BDBM62330 MLS-0425629.0001::N-(4-chlorophenyl)-4-[2-(3,4-dihydro-1H-isoquinolin-2-yl)ethyl]benzamide::cid_44251474
SMILES Clc1ccc(NC(=O)c2ccc(CCN3CCc4ccccc4C3)cc2)cc1
InChI Key InChIKey=PFWKCRBPHMRNAX-UHFFFAOYSA-N
Data  5 IC50
  Tab Delimited (TSV)   2D SDfile   Computed 3D by Vconf -m prep SDfile
Find this compound or compounds like it in BindingDB:
Activity Spreadsheet -- Enzyme Inhibition Constant Data from BindingDB
Found 5 hits for monomerid = 62330
TargetNucleotide-binding oligomerization domain-containing protein 1(Homo sapiens (Human))
Burnham Center For Chemical Genomics
Curated by PubChem BioAssay
LigandPNGBDBM62330(MLS-0425629.0001 | N-(4-chlorophenyl)-4-[2-(3,4-di...)
Affinity DataIC50:  2.00E+4nM. Assay description: Data Source: Sanford-Burnham Center for Chemical Genomics (SBCCG) Source Affiliation: Sanford-Burnham Medical Research Institute (SBMRI, San Diego, C...
In DepthDetails PCBioAssay
TargetNucleotide-binding oligomerization domain-containing protein 2(Homo sapiens (Human))
Burnham Center For Chemical Genomics
Curated by PubChem BioAssay
LigandPNGBDBM62330(MLS-0425629.0001 | N-(4-chlorophenyl)-4-[2-(3,4-di...)
Affinity DataIC50:  2.00E+4nM. Assay description: Data Source: Sanford-Burnham Center for Chemical Genomics (SBCCG) Source Affiliation: Sanford-Burnham Medical Research Institute (SBMRI, San Diego, C...
In DepthDetails PCBioAssay
TargetNucleotide-binding oligomerization domain-containing protein 1(Homo sapiens (Human))
Burnham Center For Chemical Genomics
Curated by PubChem BioAssay
LigandPNGBDBM62330(MLS-0425629.0001 | N-(4-chlorophenyl)-4-[2-(3,4-di...)
Affinity DataIC50: >2.00E+4nM. Assay description: Inhibition of NOD-1 mediated NFkappaB activation in HEK293T cells assessed as inhibition of gamma-tri-DAP-induced luciferase activity after 14 hrs by...
In DepthDetails ArticlePubMed
TargetNucleotide-binding oligomerization domain-containing protein 2(Homo sapiens (Human))
Burnham Center For Chemical Genomics
Curated by PubChem BioAssay
LigandPNGBDBM62330(MLS-0425629.0001 | N-(4-chlorophenyl)-4-[2-(3,4-di...)
Affinity DataIC50: >2.00E+4nM. Assay description: Inhibition of NOD-2 mediated NFkappaB activation in HEK293T cells assessed as inhibition of MDP-induced luciferase activity after 14 hrs by reporter ...
In DepthDetails ArticlePubMed
TargetTumor necrosis factor(Homo sapiens (Human))
Burnham Center For Chemical Genomics
Curated by PubChem BioAssay
LigandPNGBDBM62330(MLS-0425629.0001 | N-(4-chlorophenyl)-4-[2-(3,4-di...)
Affinity DataIC50: >2.00E+4nM. Assay description: Data Source: Sanford-Burnham Center for Chemical Genomics (SBCCG) Source Affiliation: Sanford-Burnham Medical Research Institute (SBMRI, San Diego, C...
In DepthDetails PCBioAssay