BDBM62349 MLS-0281326.0001::N-[1-(4-chlorobenzyl)benzimidazol-2-yl]propionamide::N-[1-[(4-chlorophenyl)methyl]-2-benzimidazolyl]propanamide::N-[1-[(4-chlorophenyl)methyl]benzimidazol-2-yl]propanamide::cid_780945
SMILES CCC(=O)Nc1nc2ccccc2n1Cc1ccc(Cl)cc1
InChI Key InChIKey=TWDDFGUXTRUDSK-UHFFFAOYSA-N
Data  4 IC50
  Tab Delimited (TSV)   2D SDfile   Computed 3D by Vconf -m prep SDfile
Find this compound or compounds like it in BindingDB:
Activity Spreadsheet -- Enzyme Inhibition Constant Data from BindingDB
Found 4 hits for monomerid = 62349
TargetInterleukin-8(Homo sapiens (Human))
Burnham Center For Chemical Genomics
Curated by PubChem BioAssay
LigandPNGBDBM62349(MLS-0281326.0001 | N-[1-(4-chlorobenzyl)benzimidaz...)
Affinity DataIC50:  1.32E+4nM. Assay description: Data Source: Sanford-Burnham Center for Chemical Genomics (SBCCG) Source Affiliation: Sanford-Burnham Medical Research Institute (SBMRI, San Diego, C...
In DepthDetails PCBioAssay
TargetTumor necrosis factor(Homo sapiens (Human))
Burnham Center For Chemical Genomics
Curated by PubChem BioAssay
LigandPNGBDBM62349(MLS-0281326.0001 | N-[1-(4-chlorobenzyl)benzimidaz...)
Affinity DataIC50: >2.00E+4nM. Assay description: Data Source: Sanford-Burnham Center for Chemical Genomics (SBCCG) Source Affiliation: Sanford-Burnham Medical Research Institute (SBMRI, San Diego, C...
In DepthDetails PCBioAssay
TargetNucleotide-binding oligomerization domain-containing protein 2(Homo sapiens (Human))
Burnham Center For Chemical Genomics
Curated by PubChem BioAssay
LigandPNGBDBM62349(MLS-0281326.0001 | N-[1-(4-chlorobenzyl)benzimidaz...)
Affinity DataIC50:  1.58E+4nM. Assay description: Data Source: Sanford-Burnham Center for Chemical Genomics (SBCCG) Source Affiliation: Sanford-Burnham Medical Research Institute (SBMRI, San Diego, C...
In DepthDetails PCBioAssay
TargetNucleotide-binding oligomerization domain-containing protein 1(Homo sapiens (Human))
Burnham Center For Chemical Genomics
Curated by PubChem BioAssay
LigandPNGBDBM62349(MLS-0281326.0001 | N-[1-(4-chlorobenzyl)benzimidaz...)
Affinity DataIC50:  1.23E+4nM. Assay description: Data Source: Sanford-Burnham Center for Chemical Genomics (SBCCG) Source Affiliation: Sanford-Burnham Medical Research Institute (SBMRI, San Diego, C...
In DepthDetails PCBioAssay