BDBM62467 (Z)-2,3-bis(2-thienyl)acrylic acid [2-keto-2-(4-sulfamoylanilino)ethyl] ester::(Z)-2,3-dithiophen-2-yl-2-propenoic acid [2-oxo-2-(4-sulfamoylanilino)ethyl] ester::MLS000418634::SMR000247557::[2-oxidanylidene-2-[(4-sulfamoylphenyl)amino]ethyl] (Z)-2,3-dithiophen-2-ylprop-2-enoate::[2-oxo-2-(4-sulfamoylanilino)ethyl] (Z)-2,3-dithiophen-2-ylprop-2-enoate::cid_2385410
SMILES NS(=O)(=O)c1ccc(NC(=O)COC(=O)C(=C\c2cccs2)\c2cccs2)cc1
InChI Key InChIKey=HCCIEACLSJCKIP-LFIBNONCSA-N
Data  2 IC50
  Tab Delimited (TSV)   2D SDfile   Computed 3D by Vconf -m prep SDfile
Find this compound or compounds like it in BindingDB:
Activity Spreadsheet -- Enzyme Inhibition Constant Data from BindingDB
Found 2 hits for monomerid = 62467
TargetEpstein-Barr nuclear antigen 1(Human herpesvirus 4)
The Scripps Research Institute Molecular Screening Center
Curated by PubChem BioAssay
LigandPNGBDBM62467((Z)-2,3-bis(2-thienyl)acrylic acid [2-keto-2-(4-su...)
Affinity DataIC50:  1.71E+4nM. Assay description: Source (MLPCN Center Name): The Scripps Research Institute Molecular Screening Center (SRIMSC) Center Affiliation: The Scripps Research Institute (TS...
In DepthDetails PCBioAssay
TargetTrans-activator protein BZLF1(Human herpesvirus 4)
The Scripps Research Institute Molecular Screening Center
Curated by PubChem BioAssay
LigandPNGBDBM62467((Z)-2,3-bis(2-thienyl)acrylic acid [2-keto-2-(4-su...)
Affinity DataIC50:  1.11E+5nM. Assay description: Source (MLPCN Center Name): The Scripps Research Institute Molecular Screening Center (SRIMSC) Center Affiliation: The Scripps Research Institute (TS...
In DepthDetails PCBioAssay