BDBM62503 2-[[3-(4-methoxyphenyl)-4-oxidanylidene-5H-pyrimido[5,4-b]indol-2-yl]sulfanyl]-N-(oxolan-2-ylmethyl)ethanamide::2-[[3-(4-methoxyphenyl)-4-oxo-5H-pyrimido[5,4-b]indol-2-yl]sulfanyl]-N-(oxolan-2-ylmethyl)acetamide::2-[[3-(4-methoxyphenyl)-4-oxo-5H-pyrimido[5,4-b]indol-2-yl]thio]-N-(2-oxolanylmethyl)acetamide::2-[[4-keto-3-(4-methoxyphenyl)-5H-pyrimid[5,4-b]indol-2-yl]thio]-N-(tetrahydrofurfuryl)acetamide::MLS000936734::SMR000621251::cid_4436088
SMILES COc1ccc(cc1)-n1c(SCC(=O)NCC2CCCO2)nc2c3ccccc3[nH]c2c1=O
InChI Key InChIKey=LGBKQBMHCAYFOK-UHFFFAOYSA-N
Data  2 IC50
  Tab Delimited (TSV)   2D SDfile   Computed 3D by Vconf -m prep SDfile
Find this compound or compounds like it in BindingDB:
Activity Spreadsheet -- Enzyme Inhibition Constant Data from BindingDB
Found 2 hits for monomerid = 62503
TargetEpstein-Barr nuclear antigen 1(Human herpesvirus 4)
The Scripps Research Institute Molecular Screening Center
Curated by PubChem BioAssay
LigandPNGBDBM62503(2-[[3-(4-methoxyphenyl)-4-oxidanylidene-5H-pyrimid...)
Affinity DataIC50:  9.89E+3nM. Assay description: Source (MLPCN Center Name): The Scripps Research Institute Molecular Screening Center (SRIMSC) Center Affiliation: The Scripps Research Institute (TS...
In DepthDetails PCBioAssay
TargetTrans-activator protein BZLF1(Human herpesvirus 4)
The Scripps Research Institute Molecular Screening Center
Curated by PubChem BioAssay
LigandPNGBDBM62503(2-[[3-(4-methoxyphenyl)-4-oxidanylidene-5H-pyrimid...)
Affinity DataIC50:  1.11E+5nM. Assay description: Source (MLPCN Center Name): The Scripps Research Institute Molecular Screening Center (SRIMSC) Center Affiliation: The Scripps Research Institute (TS...
In DepthDetails PCBioAssay