BDBM6275 8-(3-methylbutyl)-2-{[4-(4-methylpiperazin-1-yl)phenyl]amino}-7H,8H-pyrido[2,3-d]pyrimidin-7-one::N8 Pyrido[2,3-d]pyrimidin-7-one deriv. 67
SMILES CC(C)CCn1c2nc(Nc3ccc(cc3)N3CCN(C)CC3)ncc2ccc1=O
InChI Key InChIKey=CYFNFDSSPLSNKJ-UHFFFAOYSA-N
Data  1 IC50
  Tab Delimited (TSV)   2D SDfile   Computed 3D by Vconf -m prep SDfile
Find this compound or compounds like it in BindingDB:
Activity Spreadsheet -- Enzyme Inhibition Constant Data from BindingDB
Found 1 hit for monomerid = 6275
TargetCyclin-dependent kinase 4/G1/S-specific cyclin-D1 [L188C](Homo sapiens (Human))
Parke-Davis Pharmaceutical Research
LigandPNGBDBM6275(8-(3-methylbutyl)-2-{[4-(4-methylpiperazin-1-yl)ph...)
Affinity DataIC50:  13nM. Assay description: The enzyme was assayed with substrate GST- retinoblastoma in the presence of 25 uM ATP/[gamma-32P] ATP. IC50 is the inhibitor concentration, which in...
In DepthDetails ArticlePubMed