BDBM63172 (2Z)-2-[(4-nitroanilino)methylene]benzothiophen-3-one::(2Z)-2-[(4-nitroanilino)methylidene]-1-benzothiophen-3-one::(2Z)-2-[[(4-nitrophenyl)amino]methylidene]-1-benzothiophen-3-one::2-{[(4-nitrophenyl)amino]methylene}-1-benzothiophen-3(2H)-one::MLS000577142::SMR000197251::cid_5782470
SMILES [O-][N+](=O)c1ccc(cc1)\[NH+]=C\[c-]1sc2ccccc2c1=O
InChI Key InChIKey=VNYFGLHFTWZYRJ-CXUHLZMHSA-O
Data  1 EC50
  Tab Delimited (TSV)   2D SDfile   Computed 3D by Vconf -m prep SDfile
Find this compound or compounds like it in BindingDB:
Activity Spreadsheet -- Enzyme Inhibition Constant Data from BindingDB
Found 1 hit for monomerid = 63172
TargetHeat shock factor protein 1(Mus musculus)
Broad Institute
Curated by PubChem BioAssay
LigandPNGBDBM63172((2Z)-2-[(4-nitroanilino)methylene]benzothiophen-3-...)
Affinity DataEC50: >1.95E+5nM. Assay description: Keywords: Heat Shock Factor-1 (HSF-1), Stress Response, MG132, NIH3T3, Luminescence Assay Overview: Modified NIH3T3, transformed to express firefly...
In DepthDetails PCBioAssay