BDBM63738 (2,3-dihydro-1,4-benzodioxin-6-ylmethyleneamino)-(2-quinolyl)amine::MLS001006009::N-(2,3-dihydro-1,4-benzodioxin-6-ylmethylideneamino)-2-quinolinamine::N-(2,3-dihydro-1,4-benzodioxin-6-ylmethylideneamino)quinolin-2-amine::SMR000384233::[(E)-2,3-dihydro-1,4-benzodioxin-6-ylmethyleneamino]-(2-quinolyl)amine::cid_5167876
SMILES C(N=Nc1ccc2ccccc2n1)c1ccc2OCCOc2c1
InChI Key InChIKey=VLPZQGOYHUXETP-UHFFFAOYSA-N
Data  3 IC50  1 EC50
  Tab Delimited (TSV)   2D SDfile   Computed 3D by Vconf -m prep SDfile
Find this compound or compounds like it in BindingDB:
Activity Spreadsheet -- Enzyme Inhibition Constant Data from BindingDB
Found 4 hits for monomerid = 63738
TargetHeat shock factor protein 1(Mus musculus)
Broad Institute
Curated by PubChem BioAssay
LigandPNGBDBM63738((2,3-dihydro-1,4-benzodioxin-6-ylmethyleneamino)-(...)
Affinity DataEC50: <160nM. Assay description: Keywords: Heat Shock Factor-1 (HSF-1), Stress Response, MG132, NIH3T3, Luminescence Assay Overview: Modified NIH3T3, transformed to express firefly...
In DepthDetails PCBioAssay
TargetNuclear receptor coactivator 1(Homo sapiens (Human))
The Scripps Research Institute Molecular Screening Center
Curated by PubChem BioAssay
LigandPNGBDBM63738((2,3-dihydro-1,4-benzodioxin-6-ylmethyleneamino)-(...)
Affinity DataIC50:  1.43E+4nM. Assay description: Source (MLPCN Center Name): The Scripps Research Institute Molecular Screening Center (SRIMSC) Affiliation: The Scripps Research Institute, TSRI Assa...
In DepthDetails PCBioAssay
TargetTegument protein VP16(Human herpesvirus 1 (strain 17) (HHV-1) (Human her...)
The Scripps Research Institute Molecular Screening Center
Curated by PubChem BioAssay
LigandPNGBDBM63738((2,3-dihydro-1,4-benzodioxin-6-ylmethyleneamino)-(...)
Affinity DataIC50: >3.98E+3nM. Assay description: Source (MLPCN Center Name): The Scripps Research Institute Molecular Screening Center (SRIMSC) Affiliation: The Scripps Research Institute, TSRI Assa...
In DepthDetails PCBioAssay
TargetNuclear receptor coactivator 3(Homo sapiens (Human))
The Scripps Research Institute Molecular Screening Center
Curated by PubChem BioAssay
LigandPNGBDBM63738((2,3-dihydro-1,4-benzodioxin-6-ylmethyleneamino)-(...)
Affinity DataIC50:  1.62E+4nM. Assay description: Source (MLPCN Center Name): The Scripps Research Institute Molecular Screening Center (SRIMSC) Affiliation: The Scripps Research Institute, TSRI Assa...
In DepthDetails PCBioAssay