BDBM6388 3-[(5-{6-[(3-fluorophenyl)amino]pyrazin-2-yl}pyridin-3-yl)amino]propan-1-ol::3-[[5-[6-[(3-Fluorophenyl)amino]pyrazinyl]-3-pyridinyl]-amino]-1-propanol::Pyrazine-Pyridine Biheteroaryl 11
SMILES OCCCNc1cncc(c1)-c1cncc(Nc2cccc(F)c2)n1
InChI Key InChIKey=CEOOKKDARWYWCG-UHFFFAOYSA-N
Data  2 IC50
  Tab Delimited (TSV)   2D SDfile   Computed 3D by Vconf -m prep SDfile
Find this compound or compounds like it in BindingDB:
Activity Spreadsheet -- Enzyme Inhibition Constant Data from BindingDB
Found 2 hits for monomerid = 6388
TargetVascular endothelial growth factor receptor 2(Rattus norvegicus (rat))
Johnson & Johnson Pharmaceutical
LigandPNGBDBM6388(3-[(5-{6-[(3-fluorophenyl)amino]pyrazin-2-yl}pyrid...)
Affinity DataIC50:  168nMpH: 8.0 T: 2°C. Assay description: The enzyme was assayed with a biotinylated peptide substrate and test compounds in the presence of 5 uM ATP/[gamma-33P]ATP in a streptavidin coated F...
In DepthDetails ArticlePubMed
TargetCyclin-dependent kinase/G2/mitotic-specific cyclin- 1(Homo sapiens (Human))
Johnson & Johnson Pharmaceutical
LigandPNGBDBM6388(3-[(5-{6-[(3-fluorophenyl)amino]pyrazin-2-yl}pyrid...)
Affinity DataIC50: >1.00E+4nMpH: 8.0 T: 2°C. Assay description: The enzyme was assayed with a biotinylated peptide substrate and test compounds in the presence of 5 uM ATP/[gamma-33P]ATP in a streptavidin coated F...
In DepthDetails ArticlePubMed