BDBM64115 (2S)-2-[[2-(7-hydroxy-2-keto-8-methyl-chromen-4-yl)acetyl]amino]-3-(4-hydroxyphenyl)propionic acid::(2S)-2-[[2-(7-hydroxy-8-methyl-2-oxo-1-benzopyran-4-yl)-1-oxoethyl]amino]-3-(4-hydroxyphenyl)propanoic acid::(2S)-2-[[2-(7-hydroxy-8-methyl-2-oxochromen-4-yl)acetyl]amino]-3-(4-hydroxyphenyl)propanoic acid::(2S)-3-(4-hydroxyphenyl)-2-[2-(8-methyl-7-oxidanyl-2-oxidanylidene-chromen-4-yl)ethanoylamino]propanoic acid::MLS001214925::SMR000543378::cid_6851185
SMILES Cc1c(O)ccc2c(CC(=O)N[C@@H](Cc3ccc(O)cc3)C(O)=O)cc(=O)oc12
InChI Key InChIKey=JETXXEFCLPNACM-INIZCTEOSA-N
Data  1 IC50  1 EC50
  Tab Delimited (TSV)   2D SDfile   Computed 3D by Vconf -m prep SDfile
Find this compound or compounds like it in BindingDB:
Activity Spreadsheet -- Enzyme Inhibition Constant Data from BindingDB
Found 2 hits for monomerid = 64115
TargetFructose-bisphosphate aldolase(Mycobacterium tuberculosis (strain H37Rv))
The Scripps Research Institute Molecular Screening Center
Curated by PubChem BioAssay
LigandPNGBDBM64115((2S)-2-[[2-(7-hydroxy-2-keto-8-methyl-chromen-4-yl...)
Affinity DataIC50:  906nM
In DepthDetails PCBioAssay
TargetHeat shock factor protein 1(Mus musculus)
Broad Institute
Curated by PubChem BioAssay
LigandPNGBDBM64115((2S)-2-[[2-(7-hydroxy-2-keto-8-methyl-chromen-4-yl...)
Affinity DataEC50: >1.95E+5nM. Assay description: Keywords: Heat Shock Factor-1 (HSF-1), Stress Response, MG132, NIH3T3, Luminescence Assay Overview: Modified NIH3T3, transformed to express firefly...
In DepthDetails PCBioAssay