BDBM6417 4-[(5-{6-[(3-chlorophenyl)amino]pyrazin-2-yl}pyridin-3-yl)amino]butan-1-ol::4-{5-[6-(3-Chloro-phenylamino)-pyrazin-2-yl]-pyridin-3-ylamino}-butan-1-ol::Pyrazine-Pyridine Biheteroaryl 39
SMILES OCCCCNc1cncc(c1)-c1cncc(Nc2cccc(Cl)c2)n1
InChI Key InChIKey=IDNNHUIRPPFJBA-UHFFFAOYSA-N
Data  6 IC50
  Tab Delimited (TSV)   2D SDfile   Computed 3D by Vconf -m prep SDfile
Find this compound or compounds like it in BindingDB:
Activity Spreadsheet -- Enzyme Inhibition Constant Data from BindingDB
Found 6 hits for monomerid = 6417
TargetCyclin-dependent kinase/G2/mitotic-specific cyclin- 1(Homo sapiens (Human))
Johnson & Johnson Pharmaceutical
LigandPNGBDBM6417(4-[(5-{6-[(3-chlorophenyl)amino]pyrazin-2-yl}pyrid...)
Affinity DataIC50: >1.00E+4nM. Assay description: The enzyme was assayed with a biotinylated peptide substrate and test compounds in the presence of 5 uM ATP/[gamma-33P]ATP in a streptavidin coated F...
In DepthDetails ArticlePubMed
TargetVascular endothelial growth factor receptor 2(Rattus norvegicus (rat))
Johnson & Johnson Pharmaceutical
LigandPNGBDBM6417(4-[(5-{6-[(3-chlorophenyl)amino]pyrazin-2-yl}pyrid...)
Affinity DataIC50:  63nM. Assay description: The enzyme was assayed with a biotinylated peptide substrate and test compounds in the presence of 5 uM ATP/[gamma-33P]ATP in a streptavidin coated F...
In DepthDetails ArticlePubMed
TargetEpidermal growth factor receptor(Homo sapiens (Human))
Johnson & Johnson Pharmaceutical
LigandPNGBDBM6417(4-[(5-{6-[(3-chlorophenyl)amino]pyrazin-2-yl}pyrid...)
Affinity DataIC50:  7.40E+3nM. Assay description: The enzyme was assayed with a biotinylated peptide substrate and test compounds in the presence of 5 uM ATP/[gamma-33P]ATP in a streptavidin coated F...
In DepthDetails ArticlePubMed
TargetGlycogen synthase kinase-3 beta [7-25](Oryctolagus cuniculus (rabbit))
Johnson & Johnson Pharmaceutical
LigandPNGBDBM6417(4-[(5-{6-[(3-chlorophenyl)amino]pyrazin-2-yl}pyrid...)
Affinity DataIC50:  4.02E+3nM. Assay description: The enzyme was assayed with a biotinylated peptide substrate and test compounds in the presence of 5 uM ATP/[gamma-33P]ATP in a streptavidin coated F...
In DepthDetails ArticlePubMed
TargetFibroblast growth factor receptor 2(Homo sapiens (Human))
Johnson & Johnson Pharmaceutical
LigandPNGBDBM6417(4-[(5-{6-[(3-chlorophenyl)amino]pyrazin-2-yl}pyrid...)
Affinity DataIC50:  2.36E+3nM. Assay description: The enzyme was assayed with a biotinylated peptide substrate and test compounds in the presence of 5 uM ATP/[gamma-33P]ATP in a streptavidin coated F...
In DepthDetails ArticlePubMed
TargetPlatelet-derived growth factor receptor beta(Homo sapiens (Human))
Johnson & Johnson Pharmaceutical
LigandPNGBDBM6417(4-[(5-{6-[(3-chlorophenyl)amino]pyrazin-2-yl}pyrid...)
Affinity DataIC50:  2.80E+3nM. Assay description: The enzyme was assayed with a biotinylated peptide substrate and test compounds in the presence of 5 uM ATP/[gamma-33P]ATP in a streptavidin coated F...
In DepthDetails ArticlePubMed