BDBM64722 1-isopropyl-3-[(E)-2-(1-methylpyridin-1-ium-4-yl)vinyl]indole;iodide::3-[(E)-2-(1-methyl-4-pyridin-1-iumyl)ethenyl]-1-propan-2-ylindole;iodide::3-[(E)-2-(1-methylpyridin-1-ium-4-yl)ethenyl]-1-propan-2-yl-indole;iodide::3-[(E)-2-(1-methylpyridin-1-ium-4-yl)ethenyl]-1-propan-2-ylindole;iodide::4-[(E)-2-(1-Isopropyl-1H-indol-3-yl)-vinyl]-1-methyl-pyridinium::MLS001210197::SMR000504345::cid_23724431
SMILES CC(C)n1cc(\C=C\c2cc[n+](C)cc2)c2ccccc12
InChI Key InChIKey=XMWQLZAVPFWPFM-UHFFFAOYSA-N
Data  3 IC50
  Tab Delimited (TSV)   2D SDfile   Computed 3D by Vconf -m prep SDfile
Find this compound or compounds like it in BindingDB:
Activity Spreadsheet -- Enzyme Inhibition Constant Data from BindingDB
Found 3 hits for monomerid = 64722
TargetBeta-lactamase(Pseudomonas aeruginosa)
The Scripps Research Institute Molecular Screening Center
Curated by PubChem BioAssay
LigandPNGBDBM64722(1-isopropyl-3-[(E)-2-(1-methylpyridin-1-ium-4-yl)v...)
Affinity DataIC50:  2.90E+4nM. Assay description: Source (MLPCN Center Name): The Scripps Research Institute Molecular Screening Center (SRIMSC) Center Affiliation: The Scripps Research Institute (TS...
In DepthDetails PCBioAssay
TargetBeta-lactamase(Pseudomonas aeruginosa)
The Scripps Research Institute Molecular Screening Center
Curated by PubChem BioAssay
LigandPNGBDBM64722(1-isopropyl-3-[(E)-2-(1-methylpyridin-1-ium-4-yl)v...)
Affinity DataIC50:  4.18E+4nM. Assay description: Source (MLPCN Center Name): The Scripps Research Institute Molecular Screening Center (SRIMSC) Center Affiliation: The Scripps Research Institute (TS...
In DepthDetails PCBioAssay
TargetBeta-lactamase(Salmonella enterica subsp. enterica serovar Choler...)
The Scripps Research Institute Molecular Screening Center
Curated by PubChem BioAssay
LigandPNGBDBM64722(1-isopropyl-3-[(E)-2-(1-methylpyridin-1-ium-4-yl)v...)
Affinity DataIC50:  4.01E+4nM. Assay description: Source (MLPCN Center Name): The Scripps Research Institute Molecular Screening Center (SRIMSC) Center Affiliation: The Scripps Research Institute (TS...
In DepthDetails PCBioAssay