BDBM64878 3-(4-Methyl-benzyl)-5-[1-(toluene-4-sulfonyl)-piperidin-4-yl]-3H-[1,2,3]triazolo[4,5-d]pyrimidin-7-ol::3-(4-methylbenzyl)-5-(1-tosyl-4-piperidyl)-2H-triazolo[4,5-d]pyrimidin-7-one::3-[(4-methylphenyl)methyl]-5-[1-(4-methylphenyl)sulfonyl-4-piperidinyl]-2H-triazolo[4,5-d]pyrimidin-7-one::3-[(4-methylphenyl)methyl]-5-[1-(4-methylphenyl)sulfonylpiperidin-4-yl]-2H-[1,2,3]triazolo[4,5-d]pyrimidin-7-one::3-[(4-methylphenyl)methyl]-5-[1-(4-methylphenyl)sulfonylpiperidin-4-yl]-2H-triazolo[4,5-d]pyrimidin-7-one::MLS000035422::SMR000007393::cid_648893
SMILES Cc1ccc(Cn2nnc3c2nc([nH]c3=O)C2CCN(CC2)S(=O)(=O)c2ccc(C)cc2)cc1
InChI Key InChIKey=GGYRJRGVNDSQTJ-UHFFFAOYSA-N
Data  1 EC50
  Tab Delimited (TSV)   2D SDfile   Computed 3D by Vconf -m prep SDfile
Find this compound or compounds like it in BindingDB:
Activity Spreadsheet -- Enzyme Inhibition Constant Data from BindingDB
Found 1 hit for monomerid = 64878
TargetATP-dependent molecular chaperone HSP82(Candida albicans)
Broad Institute
Curated by PubChem BioAssay
LigandPNGBDBM64878(3-(4-Methyl-benzyl)-5-[1-(toluene-4-sulfonyl)-pipe...)
Affinity DataEC50: >1.50E+5nM. Assay description: Broad Institute: Reversing Antifungal Drug Resistance Project ID: 2037 Keywords: Candida albicans, drug resistance, Fluconazole, Hsp90, Calcineurin, ...
In DepthDetails PCBioAssay