BDBM64896 4-(hydroxymethyl)-8-quinolinol::4-(hydroxymethyl)quinolin-8-ol::4-methylolquinolin-8-ol::MLS000080777::SMR000039489::cid_658612
SMILES OCc1ccnc2c(O)cccc12
InChI Key InChIKey=STAXGMKKJCRDRH-UHFFFAOYSA-N
Data  1 EC50
  Tab Delimited (TSV)   2D SDfile   Computed 3D by Vconf -m prep SDfile
Find this compound or compounds like it in BindingDB:
Activity Spreadsheet -- Enzyme Inhibition Constant Data from BindingDB
Found 1 hit for monomerid = 64896
TargetATP-dependent molecular chaperone HSP82(Candida albicans)
Broad Institute
Curated by PubChem BioAssay
LigandPNGBDBM64896(4-(hydroxymethyl)-8-quinolinol | 4-(hydroxymethyl)...)
Affinity DataEC50: >1.60E+5nM. Assay description: Broad Institute: Reversing Antifungal Drug Resistance Project ID: 2037 Keywords: Candida albicans, drug resistance, Fluconazole, Hsp90, Calcineurin, ...
In DepthDetails PCBioAssay