BDBM65383 BDBM260657::US9533985, 157
SMILES Cn1ccc(=O)n(-c2ccc(C[C@H](NC(=O)c3c(F)cc(NS(=O)(=O)c4ccc(cc4)C(=O)NC4CC4)cc3F)C(O)=O)cc2)c1=O
InChI Key InChIKey=JOGCJPQFIJVLJJ-VWLOTQADSA-N
Data  4 IC50
  Tab Delimited (TSV)   2D SDfile   Computed 3D by Vconf -m prep SDfile
Find this compound or compounds like it in BindingDB:
Activity Spreadsheet -- Enzyme Inhibition Constant Data from BindingDB
Found 4 hits for monomerid = 65383
LigandPNGBDBM65383(BDBM260657 | US9533985, 157)
Affinity DataIC50: <50nMpH: 9.6 T: 2°C. Assay description: The ability of test substances to inhibit the binding of a human B cell line, RPMI-8866, which is known to express α4β7 integrin, to MAdCA...
Ligand InfoPC cidPC sid
In DepthDetails US Patent
LigandPNGBDBM65383(BDBM260657 | US9533985, 157)
Affinity DataIC50:  21nMpH: 9.6 T: 2°C. Assay description: The ability of test substances to inhibit the binding of a human B cell line, RPMI-8866, which is known to express α4β7 integrin, to MAdCA...
Ligand InfoPC cidPC sid
In DepthDetails US Patent
TargetIntegrin alpha-4/Integrin beta-1/Vascular cell adhesion protein 1(Homo sapiens (Human))
Ea Pharma
US Patent
LigandPNGBDBM65383(BDBM260657 | US9533985, 157)
Affinity DataIC50:  500nMpH: 9.6 T: 2°C. Assay description: The ability of test substances to inhibit the binding of a human T-cell line, Jurkat, which is known to express α4β1 integrin, to VCAM-1 w...
Ligand InfoPC cidPC sid
In DepthDetails US Patent
LigandPNGBDBM65383(BDBM260657 | US9533985, 157)
Affinity DataIC50:  0.970nMpH: 9.6 T: 2°C. Assay description: The ability of test substances to inhibit the binding of a human B cell line, RPMI-8866, which is known to express α4β7 integrin, to MAdCA...
Ligand InfoPC cidPC sid
In DepthDetails US Patent