BDBM65389 US9533985, 158
SMILES Cc1cc(ccc1S(=O)(=O)Nc1cc(F)c(C(=O)N[C@@H](Cc2ccc(cc2)-n2c(=O)ccn(C)c2=O)C(O)=O)c(F)c1)C(=O)NC(C)(C)C
InChI Key InChIKey=ZRCNSIYBVLHZQP-VWLOTQADSA-N
Data  1 IC50
  Tab Delimited (TSV)   2D SDfile   Computed 3D by Vconf -m prep SDfile
Find this compound or compounds like it in BindingDB:
Activity Spreadsheet -- Enzyme Inhibition Constant Data from BindingDB
Found 1 hit for monomerid = 65389
LigandPNGBDBM65389(US9533985, 158)
Affinity DataIC50: <10nMpH: 9.6 T: 2°C. Assay description: The ability of test substances to inhibit the binding of a human B cell line, RPMI-8866, which is known to express α4β7 integrin, to MAdCA...
In DepthDetails US Patent