BDBM65532 (S)-N-(6-(hydroxyamino)-6-oxohexyl)-4-(3-(2-oxo-1-phenyl-2-(p-tolylamino)ethyl)ureido)benzamide (L9)
SMILES Cc1ccc(NC(=O)[C@@H](NC(=O)Nc2ccc(cc2)C(=O)NCCCCCC(=O)NO)c2ccccc2)cc1
InChI Key InChIKey=QGTRPJWPZHJGEC-SANMLTNESA-N
Data  1 IC50
  Tab Delimited (TSV)   2D SDfile   Computed 3D by Vconf -m prep SDfile
Find this compound or compounds like it in BindingDB:
Activity Spreadsheet -- Enzyme Inhibition Constant Data from BindingDB
Found 1 hit for monomerid = 65532
TargetHistone deacetylase 8(Homo sapiens (Human))
Qingdao University
LigandPNGBDBM65532((S)-N-(6-(hydroxyamino)-6-oxohexyl)-4-(3-(2-oxo-1-...)
Affinity DataIC50:  1.87E+3nM. Assay description: The nucleus extract was extracted from HDAC8 enzyme was expressed in Escherichia coli. Boc-Lys (acetyl)-AMC was used as the substrate of HDAC. SAHA w...
In DepthDetails ArticlePubMed