BDBM65650 3-(4-methylphenyl)sulfonyl-N-(4-pyridin-4-yl-1,3-thiazol-2-yl)propanamide::3-(4-methylphenyl)sulfonyl-N-(4-pyridin-4-yl-2-thiazolyl)propanamide::MLS001097129::N-[4-(4-pyridyl)thiazol-2-yl]-3-tosyl-propionamide::SMR000633864::cid_22581361
SMILES Cc1ccc(cc1)S(=O)(=O)CCC(=O)Nc1nc(cs1)-c1ccncc1
InChI Key InChIKey=WRMHUDYTULRRKS-UHFFFAOYSA-N
Data  2 IC50
  Tab Delimited (TSV)   2D SDfile   Computed 3D by Vconf -m prep SDfile
Find this compound or compounds like it in BindingDB:
Activity Spreadsheet -- Enzyme Inhibition Constant Data from BindingDB
Found 2 hits for monomerid = 65650
Target1-phosphatidylinositol 4,5-bisphosphate phosphodiesterase beta-3(Homo sapiens (Human))
The Scripps Research Institute Molecular Screening Center
Curated by PubChem BioAssay
LigandPNGBDBM65650(3-(4-methylphenyl)sulfonyl-N-(4-pyridin-4-yl-1,3-t...)
Affinity DataIC50:  1.22E+5nM. Assay description: Source (MLPCN Center Name): The Scripps Research Institute Molecular Screening Center (SRIMSC) Center Affiliation: The Scripps Research Institute Ass...
In DepthDetails PCBioAssay
Target1-phosphatidylinositol 4,5-bisphosphate phosphodiesterase gamma-1 [1-999,I813T](Homo sapiens (Human))
The Scripps Research Institute Molecular Screening Center
Curated by PubChem BioAssay
LigandPNGBDBM65650(3-(4-methylphenyl)sulfonyl-N-(4-pyridin-4-yl-1,3-t...)
Affinity DataIC50:  1.22E+5nM. Assay description: Source (MLPCN Center Name): The Scripps Research Institute Molecular Screening Center (SRIMSC) Center Affiliation: The Scripps Research Institute Ass...
In DepthDetails PCBioAssay