BDBM65743 4-methoxy-2-phenyl-quinazoline::4-methoxy-2-phenylquinazoline::BRD-K31596841-001-01-6::cid_616867
SMILES COc1nc(nc2ccccc12)-c1ccccc1
InChI Key InChIKey=SLMVMPUVHALQML-UHFFFAOYSA-N
Data  1 EC50
  Tab Delimited (TSV)   2D SDfile   Computed 3D by Vconf -m prep SDfile
Find this compound or compounds like it in BindingDB:
Activity Spreadsheet -- Enzyme Inhibition Constant Data from BindingDB
Found 1 hit for monomerid = 65743
TargetStreptokinase A(Streptococcus pyogenes M1 GAS)
Broad Institute
Curated by PubChem BioAssay
LigandPNGBDBM65743(4-methoxy-2-phenyl-quinazoline | 4-methoxy-2-pheny...)
Affinity DataEC50:  7.54E+4nM. Assay description: Keywords: Group A streptococcus, GAS, streptokinase, expression, virulence, inhibition, dose response, EC50 Assay Overview: The goal of this assa...
In DepthDetails PCBioAssay