BDBM65777 2-(2-furanyl)-N-[(4-methoxyphenyl)methyl]-4-quinolinecarboxamide::2-(2-furyl)-N-p-anisyl-cinchoninamide::2-(furan-2-yl)-N-[(4-methoxyphenyl)methyl]quinoline-4-carboxamide::MLS-0315912.0001::cid_2634658
SMILES COc1ccc(CNC(=O)c2cc(nc3ccccc23)-c2ccco2)cc1
InChI Key InChIKey=BMWLGEWJVOSJDJ-UHFFFAOYSA-N
Data  2 IC50
  Tab Delimited (TSV)   2D SDfile   Computed 3D by Vconf -m prep SDfile
Find this compound or compounds like it in BindingDB:
Activity Spreadsheet -- Enzyme Inhibition Constant Data from BindingDB
Found 2 hits for monomerid = 65777
TargetAmyloid-beta A4 precursor protein-binding family A member 1(Rattus norvegicus)
Burnham Center For Chemical Genomics
Curated by PubChem BioAssay
LigandPNGBDBM65777(2-(2-furanyl)-N-[(4-methoxyphenyl)methyl]-4-quinol...)
Affinity DataIC50:  2.03E+4nM. Assay description: Data Source: Sanford-Burnham Center for Chemical Genomics (SBCCG) Source Affiliation: Sanford-Burnham Medical Research Institute (SBMRI, San Diego, C...
In DepthDetails PCBioAssay
TargetAmyloid-beta A4 precursor protein-binding family A member 1(Rattus norvegicus)
Burnham Center For Chemical Genomics
Curated by PubChem BioAssay
LigandPNGBDBM65777(2-(2-furanyl)-N-[(4-methoxyphenyl)methyl]-4-quinol...)
Affinity DataIC50: >5.68E+4nM. Assay description: Data Source: Sanford-Burnham Center for Chemical Genomics (SBCCG) Source Affiliation: Sanford-Burnham Medical Research Institute (SBMRI, San Diego, C...
In DepthDetails PCBioAssay