BDBM65820 2-[4-(2-furanylmethyl)-5-(phenylmethylthio)-1,2,4-triazol-3-yl]pyridine::2-[4-(furan-2-ylmethyl)-5-(phenylmethylsulfanyl)-1,2,4-triazol-3-yl]pyridine::2-[5-(benzylthio)-4-(2-furfuryl)-1,2,4-triazol-3-yl]pyridine::2-[5-benzylsulfanyl-4-(furan-2-ylmethyl)-1,2,4-triazol-3-yl]pyridine::KSC-5-252::KUC103896N::cid_44601466
SMILES C(Sc1nnc(-c2ccccn2)n1Cc1ccco1)c1ccccc1
InChI Key InChIKey=JFXHTECZZIPNMK-UHFFFAOYSA-N
Data  1 IC50  4 EC50
  Tab Delimited (TSV)   2D SDfile   Computed 3D by Vconf -m prep SDfile
Find this compound or compounds like it in BindingDB:
Activity Spreadsheet -- Enzyme Inhibition Constant Data from BindingDB
Found 5 hits for monomerid = 65820
TargetKappa-type opioid receptor(Homo sapiens (Human))
Burnham Center For Chemical Genomics
Curated by PubChem BioAssay
LigandPNGBDBM65820(2-[4-(2-furanylmethyl)-5-(phenylmethylthio)-1,2,4-...)
Affinity DataIC50: >3.20E+4nM. Assay description: Data Source: Sanford-Burnham Center for Chemical Genomics Source Affiliation: Sanford-Burnham Medical Research Institute Network: NIH Molecular Lib...
In DepthDetails PCBioAssay
TargetMu-type opioid receptor(Homo sapiens (Human))
Burnham Center For Chemical Genomics
Curated by PubChem BioAssay
LigandPNGBDBM65820(2-[4-(2-furanylmethyl)-5-(phenylmethylthio)-1,2,4-...)
Affinity DataEC50: >3.20E+4nM. Assay description: Data Source: Sanford-Burnham Center for Chemical Genomics (SBCCG) Source Affiliation: Sanford-Burnham Medical Research Institute (SBMRI, San Diego, C...
In DepthDetails PCBioAssay
TargetKappa-type opioid receptor(Homo sapiens (Human))
Burnham Center For Chemical Genomics
Curated by PubChem BioAssay
LigandPNGBDBM65820(2-[4-(2-furanylmethyl)-5-(phenylmethylthio)-1,2,4-...)
Affinity DataEC50:  1.79E+4nM. Assay description: Data Source: Sanford-Burnham Center for Chemical Genomics (SBCCG) Source Affiliation: Sanford-Burnham Medical Research Institute (SBMRI, San Diego, C...
In DepthDetails PCBioAssay
TargetKappa-type opioid receptor(Homo sapiens (Human))
Burnham Center For Chemical Genomics
Curated by PubChem BioAssay
LigandPNGBDBM65820(2-[4-(2-furanylmethyl)-5-(phenylmethylthio)-1,2,4-...)
Affinity DataEC50: >3.20E+4nM. Assay description: Data Source: Sanford-Burnham Center for Chemical Genomics Source Affiliation: Sanford-Burnham Medical Research Institute Network: NIH Molecular Lib...
In DepthDetails PCBioAssay
TargetDelta-type opioid receptor(Homo sapiens (Human))
Burnham Center For Chemical Genomics
Curated by PubChem BioAssay
LigandPNGBDBM65820(2-[4-(2-furanylmethyl)-5-(phenylmethylthio)-1,2,4-...)
Affinity DataEC50: >3.20E+4nM. Assay description: Data Source: Sanford-Burnham Center for Chemical Genomics (SBCCG) Source Affiliation: Sanford-Burnham Medical Research Institute (SBMRI, San Diego, C...
In DepthDetails PCBioAssay