BDBM65843 3-methoxy-10H-phenothiazine::SR-01000025134::SR-01000025134-4::cid_74491
SMILES COc1ccc2Nc3ccccc3Sc2c1
InChI Key InChIKey=NKRGJNZQQYCJHD-UHFFFAOYSA-N
Data  2 IC50
  Tab Delimited (TSV)   2D SDfile   Computed 3D by Vconf -m prep SDfile
Find this compound or compounds like it in BindingDB:
Activity Spreadsheet -- Enzyme Inhibition Constant Data from BindingDB
Found 2 hits for monomerid = 65843
TargetNADPH oxidase 1(Homo sapiens (Human))
The Scripps Research Institute Molecular Screening Center
Curated by PubChem BioAssay
LigandPNGBDBM65843(3-methoxy-10H-phenothiazine | SR-01000025134 | SR-...)
Affinity DataIC50:  936nM. Assay description: Data Source (MLPCN Center Name): The Scripps Research Institute Molecular Screening Center (SRIMSC) Center Affiliation: The Scripps Research Institut...
In DepthDetails PCBioAssay
TargetNADPH oxidase 1(Homo sapiens (Human))
The Scripps Research Institute Molecular Screening Center
Curated by PubChem BioAssay
LigandPNGBDBM65843(3-methoxy-10H-phenothiazine | SR-01000025134 | SR-...)
Affinity DataIC50: >2.00E+4nM. Assay description: Data Source (MLPCN Center Name): The Scripps Research Institute Molecular Screening Center (SRIMSC) Center Affiliation: The Scripps Research Institut...
In DepthDetails PCBioAssay