BDBM65894 5-chloranyl-2-[(3-methylphenyl)methylsulfonyl]-N-(5-propyl-1,3,4-thiadiazol-2-yl)pyrimidine-4-carboxamide::5-chloro-2-(3-methylbenzyl)sulfonyl-N-(5-propyl-1,3,4-thiadiazol-2-yl)pyrimidine-4-carboxamide::5-chloro-2-[(3-methylphenyl)methylsulfonyl]-N-(5-propyl-1,3,4-thiadiazol-2-yl)-4-pyrimidinecarboxamide::5-chloro-2-[(3-methylphenyl)methylsulfonyl]-N-(5-propyl-1,3,4-thiadiazol-2-yl)pyrimidine-4-carboxamide::MLS001116179::SMR000625802::cid_16447014
SMILES CCCc1nnc(NC(=O)c2nc(ncc2Cl)S(=O)(=O)Cc2cccc(C)c2)s1
InChI Key InChIKey=KTHRYUDJDPXKKD-UHFFFAOYSA-N
Data  6 IC50  1 EC50
  Tab Delimited (TSV)   2D SDfile   Computed 3D by Vconf -m prep SDfile
Find this compound or compounds like it in BindingDB:
Activity Spreadsheet -- Enzyme Inhibition Constant Data from BindingDB
Found 7 hits for monomerid = 65894
TargetPotassium voltage-gated channel subfamily KQT member 2(Rattus norvegicus)
Johns Hopkins Ion Channel Center
Curated by PubChem BioAssay
LigandPNGBDBM65894(5-chloranyl-2-[(3-methylphenyl)methylsulfonyl]-N-(...)
Affinity DataEC50:  2.89E+3nM. Assay description: BioAssay Type: Confirmatory, Concentration-Response Relationship Observed Source (MLPCN Center Name): Johns Hopkins Ion Channel Center (JHICC) Center...
In DepthDetails PCBioAssay
TargetUbiquitin-conjugating enzyme E2 N(Homo sapiens (Human))
Burnham Center For Chemical Genomics
Curated by PubChem BioAssay
LigandPNGBDBM65894(5-chloranyl-2-[(3-methylphenyl)methylsulfonyl]-N-(...)
Affinity DataIC50:  1.23E+4nM. Assay description: Data Source: Sanford-Burnham Center for Chemical Genomics (SBCCG) Source Affiliation: Sanford-Burnham Medical Research Institute (SBMRI, San Diego CA...
In DepthDetails PCBioAssay
TargetBcl-2-related protein A1(Mus musculus (Mouse))
Burnham Center For Chemical Genomics
Curated by PubChem BioAssay
LigandPNGBDBM65894(5-chloranyl-2-[(3-methylphenyl)methylsulfonyl]-N-(...)
Affinity DataIC50: >2.00E+4nM. Assay description: Data Source: Sanford-Burnham Center for Chemical Genomics (SBCCG) Source Affiliation: Sanford-Burnham Medical Research Institute (SBMRI, San Diego CA...
In DepthDetails PCBioAssay
TargetPerilipin-5(Homo sapiens (Human))
The Scripps Research Institute Molecular Screening Center
Curated by PubChem BioAssay
LigandPNGBDBM65894(5-chloranyl-2-[(3-methylphenyl)methylsulfonyl]-N-(...)
Affinity DataIC50:  3.41E+3nM
In DepthDetails PCBioAssay
TargetHepatocyte nuclear factor 4-alpha(Homo sapiens (Human))
The Scripps Research Institute Molecular Screening Center
Curated by PubChem BioAssay
LigandPNGBDBM65894(5-chloranyl-2-[(3-methylphenyl)methylsulfonyl]-N-(...)
Affinity DataIC50:  5.71E+3nM
In DepthDetails PCBioAssay
TargetPerilipin-1(Homo sapiens (Human))
The Scripps Research Institute Molecular Screening Center
Curated by PubChem BioAssay
LigandPNGBDBM65894(5-chloranyl-2-[(3-methylphenyl)methylsulfonyl]-N-(...)
Affinity DataIC50:  2.83E+3nM
In DepthDetails PCBioAssay
TargetUbiquitin-conjugating enzyme E2 N(Homo sapiens (Human))
Burnham Center For Chemical Genomics
Curated by PubChem BioAssay
LigandPNGBDBM65894(5-chloranyl-2-[(3-methylphenyl)methylsulfonyl]-N-(...)
Affinity DataIC50: >2.00E+4nM. Assay description: Data Source: Sanford-Burnham Center for Chemical Genomics (SBCCG) Source Affiliation: Sanford-Burnham Medical Research Institute (SBMRI, San Diego CA...
In DepthDetails PCBioAssay