BDBM65995 2-Cyano-2-[(4-methoxy-phenyl)-hydrazono]-acetamide::2-amino-N-(4-methoxyanilino)-2-oxoethanimidoyl cyanide::2-cyano-2-[(4-methoxyphenyl)hydrazinylidene]acetamide::2-cyano-2-[(4-methoxyphenyl)hydrazinylidene]ethanamide::2-cyano-2-[(4-methoxyphenyl)hydrazono]acetamide::MLS000587502::SMR000211442::cid_910148
SMILES COc1ccc(NN=C(C#N)C(N)=O)cc1
InChI Key InChIKey=GBQSUNNLJBYSQN-UHFFFAOYSA-N
Data  1 EC50
  Tab Delimited (TSV)   2D SDfile   Computed 3D by Vconf -m prep SDfile
Find this compound or compounds like it in BindingDB:
Activity Spreadsheet -- Enzyme Inhibition Constant Data from BindingDB
Found 1 hit for monomerid = 65995
Target60S ribosomal protein L19-A(Saccharomyces cerevisiae)
Nmmlsc
Curated by PubChem BioAssay
LigandPNGBDBM65995(2-Cyano-2-[(4-methoxy-phenyl)-hydrazono]-acetamide...)
Affinity DataEC50:  2.96E+3nM. Assay description: University of New Mexico Assay Overview: Assay Support: 1R03 MH086450-01 Project Title: Chemical Screen of TOR pathway GFP fusion proteins in S. ...
In DepthDetails PCBioAssay