BDBM66140 5-amino-1-[4-(2-methoxyphenyl)-1,3-thiazol-2-yl]pyrazole-4-carbonitrile::5-amino-1-[4-(2-methoxyphenyl)-2-thiazolyl]-4-pyrazolecarbonitrile::5-amino-1-[4-(2-methoxyphenyl)thiazol-2-yl]pyrazole-4-carbonitrile::5-azanyl-1-[4-(2-methoxyphenyl)-1,3-thiazol-2-yl]pyrazole-4-carbonitrile::MLS001171943::SMR000591509::cid_2086961
SMILES COc1ccccc1-c1csc(n1)-n1ncc(C#N)c1N
InChI Key InChIKey=IYNKGFHSFZKWKD-UHFFFAOYSA-N
Data  3 IC50
  Tab Delimited (TSV)   2D SDfile   Computed 3D by Vconf -m prep SDfile
Find this compound or compounds like it in BindingDB:
Activity Spreadsheet -- Enzyme Inhibition Constant Data from BindingDB
Found 3 hits for monomerid = 66140
TargetBeta-lactamase(Pseudomonas aeruginosa)
The Scripps Research Institute Molecular Screening Center
Curated by PubChem BioAssay
LigandPNGBDBM66140(5-amino-1-[4-(2-methoxyphenyl)-1,3-thiazol-2-yl]py...)
Affinity DataIC50: >5.96E+4nM. Assay description: Source (MLPCN Center Name): The Scripps Research Institute Molecular Screening Center (SRIMSC) Center Affiliation: The Scripps Research Institute (TS...
In DepthDetails PCBioAssay
TargetBeta-lactamase(Pseudomonas aeruginosa)
The Scripps Research Institute Molecular Screening Center
Curated by PubChem BioAssay
LigandPNGBDBM66140(5-amino-1-[4-(2-methoxyphenyl)-1,3-thiazol-2-yl]py...)
Affinity DataIC50: >5.96E+4nM. Assay description: Source (MLPCN Center Name): The Scripps Research Institute Molecular Screening Center (SRIMSC) Center Affiliation: The Scripps Research Institute (TS...
In DepthDetails PCBioAssay
TargetBeta-lactamase(Salmonella enterica subsp. enterica serovar Choler...)
The Scripps Research Institute Molecular Screening Center
Curated by PubChem BioAssay
LigandPNGBDBM66140(5-amino-1-[4-(2-methoxyphenyl)-1,3-thiazol-2-yl]py...)
Affinity DataIC50: >5.96E+4nM. Assay description: Source (MLPCN Center Name): The Scripps Research Institute Molecular Screening Center (SRIMSC) Center Affiliation: The Scripps Research Institute (TS...
In DepthDetails PCBioAssay