BDBM66167 3-(4-methylphenyl)-2-sulfanylidene-1H-[1]benzofuro[3,2-d]pyrimidin-4-one::3-(4-methylphenyl)-2-sulfanylidene-1H-benzofuro[3,2-d]pyrimidin-4-one::3-(p-tolyl)-2-thioxo-1H-benzofuro[3,2-d]pyrimidin-4-one::MLS000418892::SMR000236843::cid_7120056
SMILES Cc1ccc(cc1)-n1c(=S)[nH]c2c3ccccc3oc2c1=O
InChI Key InChIKey=LCFRXYNGFSBFGV-UHFFFAOYSA-N
Data  5 IC50
  Tab Delimited (TSV)   2D SDfile   Computed 3D by Vconf -m prep SDfile
Find this compound or compounds like it in BindingDB:
Activity Spreadsheet -- Enzyme Inhibition Constant Data from BindingDB
Found 5 hits for monomerid = 66167
TargetPhotoreceptor-specific nuclear receptor(Homo sapiens (Human))
The Scripps Research Institute Molecular Screening Center
Curated by PubChem BioAssay
LigandPNGBDBM66167(3-(4-methylphenyl)-2-sulfanylidene-1H-[1]benzofuro...)
Affinity DataIC50:  4.75E+3nM. Assay description: Source (MLPCN Center Name): The Scripps Research Institute Molecular Screening Center Affiliation: The Scripps Research Institute, TSRI Assay Provide...
In DepthDetails PCBioAssay
TargetIsoform 2 of Nuclear receptor corepressor 2 (TRAC-1)(Homo sapiens (Human))
The Scripps Research Institute Molecular Screening Center
Curated by PubChem BioAssay
LigandPNGBDBM66167(3-(4-methylphenyl)-2-sulfanylidene-1H-[1]benzofuro...)
Affinity DataIC50:  6.54E+3nM. Assay description: Source (MLPCN Center Name): The Scripps Research Institute Molecular Screening Center Affiliation: The Scripps Research Institute, TSRI Assay Provide...
In DepthDetails PCBioAssay
TargetEnvelope glycoprotein gp160(Human immunodeficiency virus type 1 group M subtyp...)
The Scripps Research Institute Molecular Screening Center
Curated by PubChem BioAssay
LigandPNGBDBM66167(3-(4-methylphenyl)-2-sulfanylidene-1H-[1]benzofuro...)
Affinity DataIC50: >6.70E+4nM
In DepthDetails PCBioAssay
TargetEnvelope glycoprotein gp160(Human immunodeficiency virus type 1 group M subtyp...)
The Scripps Research Institute Molecular Screening Center
Curated by PubChem BioAssay
LigandPNGBDBM66167(3-(4-methylphenyl)-2-sulfanylidene-1H-[1]benzofuro...)
Affinity DataIC50: >6.70E+4nM
In DepthDetails PCBioAssay
TargetEnvelope glycoprotein gp160(Human immunodeficiency virus type 1 group M subtyp...)
The Scripps Research Institute Molecular Screening Center
Curated by PubChem BioAssay
LigandPNGBDBM66167(3-(4-methylphenyl)-2-sulfanylidene-1H-[1]benzofuro...)
Affinity DataIC50: >6.70E+4nM
In DepthDetails PCBioAssay