BDBM66331 1-N-benzyl-4-N,4-N-dicyclohexylbenzene-1,4-dicarboxamide::MLS000531974::N'-benzyl-N,N-dicyclohexylterephthalamide::N-benzyl-N',N'-dicyclohexyl-terephthalamide::N4,N4-dicyclohexyl-N1-(phenylmethyl)benzene-1,4-dicarboxamide::SMR000136917::cid_2056359
SMILES O=C(NCc1ccccc1)c1ccc(cc1)C(=O)N(C1CCCCC1)C1CCCCC1
InChI Key InChIKey=BMEBNMBANZRCJA-UHFFFAOYSA-N
Data  1 EC50
  Tab Delimited (TSV)   2D SDfile   Computed 3D by Vconf -m prep SDfile
Find this compound or compounds like it in BindingDB:
Activity Spreadsheet -- Enzyme Inhibition Constant Data from BindingDB
Found 1 hit for monomerid = 66331
TargetBcl-2-like protein 11(Homo sapiens (Human))
Broad Institute
Curated by PubChem BioAssay
LigandPNGBDBM66331(1-N-benzyl-4-N,4-N-dicyclohexylbenzene-1,4-dicarbo...)
Affinity DataEC50: >3.50E+5nM. Assay description: Keywords: apoptosis, BH3 domain, Bcl2-A1, BIM, caspase, cancer Primary Collaborator: Todd Golub, Broad Institute, golub@broadinstitute.org Assay Over...
In DepthDetails PCBioAssay