BDBM66383 (Z)-3-(5-Morpholin-4-yl-furan-2-yl)-2-phenyl-acrylonitrile::(Z)-3-(5-morpholin-4-ylfuran-2-yl)-2-phenyl-prop-2-enenitrile::(Z)-3-(5-morpholin-4-ylfuran-2-yl)-2-phenylprop-2-enenitrile::(Z)-3-(5-morpholino-2-furyl)-2-phenyl-acrylonitrile::(Z)-3-[5-(4-morpholinyl)-2-furanyl]-2-phenyl-2-propenenitrile::MLS000558396::SMR000178645::cid_802293
SMILES N#C\C(=C/c1ccc(o1)N1CCOCC1)c1ccccc1
InChI Key InChIKey=CGIVHWUJFVEVKK-NTCAYCPXSA-N
Data  1 EC50
  Tab Delimited (TSV)   2D SDfile   Computed 3D by Vconf -m prep SDfile
Find this compound or compounds like it in BindingDB:
Activity Spreadsheet -- Enzyme Inhibition Constant Data from BindingDB
Found 1 hit for monomerid = 66383
TargetBcl-2-like protein 11(Homo sapiens (Human))
Broad Institute
Curated by PubChem BioAssay
LigandPNGBDBM66383((Z)-3-(5-Morpholin-4-yl-furan-2-yl)-2-phenyl-acryl...)
Affinity DataEC50: >3.50E+5nM. Assay description: Keywords: apoptosis, BH3 domain, Bcl2-A1, BIM, caspase, cancer Primary Collaborator: Todd Golub, Broad Institute, golub@broadinstitute.org Assay Over...
In DepthDetails PCBioAssay