BDBM66685 (5E)-3-(2-furanylmethyl)-5-[[2-[2-(2-hydroxyethoxy)ethylamino]-4-oxo-3-pyrido[1,2-a]pyrimidinyl]methylidene]-2-sulfanylidene-4-thiazolidinone::(5E)-3-(2-furfuryl)-5-[[2-[2-(2-hydroxyethoxy)ethylamino]-4-keto-pyrido[1,2-a]pyrimidin-3-yl]methylene]-2-thioxo-thiazolidin-4-one::(5E)-3-(furan-2-ylmethyl)-5-[[2-[2-(2-hydroxyethoxy)ethylamino]-4-oxopyrido[1,2-a]pyrimidin-3-yl]methylidene]-2-sulfanylidene-1,3-thiazolidin-4-one::(5E)-3-(furan-2-ylmethyl)-5-[[2-[2-(2-hydroxyethyloxy)ethylamino]-4-oxidanylidene-pyrido[1,2-a]pyrimidin-3-yl]methylidene]-2-sulfanylidene-1,3-thiazolidin-4-one::3-{[3-(2-furylmethyl)-4-oxo-2-thioxo-1,3-thiazolidin-5-ylidene]methyl}-2-{[2-(2-hydroxyethoxy)ethyl]amino}-4H-pyrido[1,2-a]pyrimidin-4-one::MLS000974865::SMR000497585::cid_5737231
SMILES OCCOCCNc1nc2ccccn2c(=O)c1\C=C1\SC(=S)N(Cc2ccco2)C1=O
InChI Key InChIKey=UDFDCNJUEKECJH-FOWTUZBSSA-N
Data  1 EC50
  Tab Delimited (TSV)   2D SDfile   Computed 3D by Vconf -m prep SDfile
Find this compound or compounds like it in BindingDB:
Activity Spreadsheet -- Enzyme Inhibition Constant Data from BindingDB
Found 1 hit for monomerid = 66685
TargetBcl-2-like protein 11(Homo sapiens (Human))
Broad Institute
Curated by PubChem BioAssay
LigandPNGBDBM66685((5E)-3-(2-furanylmethyl)-5-[[2-[2-(2-hydroxyethoxy...)
Affinity DataEC50: >3.50E+5nM. Assay description: Keywords: apoptosis, BH3 domain, Bcl2-A1, BIM, caspase, cancer Primary Collaborator: Todd Golub, Broad Institute, golub@broadinstitute.org Assay Over...
In DepthDetails PCBioAssay