BDBM66690 2-({[4-(3-chlorophenyl)-1-piperazinyl]acetyl}amino)-N,N,4-trimethyl-1,3-thiazole-5-carboxamide::2-[2-[4-(3-chlorophenyl)piperazin-1-yl]ethanoylamino]-N,N,4-trimethyl-1,3-thiazole-5-carboxamide::2-[[2-[4-(3-chlorophenyl)-1-piperazinyl]-1-oxoethyl]amino]-N,N,4-trimethyl-5-thiazolecarboxamide::2-[[2-[4-(3-chlorophenyl)piperazin-1-yl]acetyl]amino]-N,N,4-trimethyl-1,3-thiazole-5-carboxamide::2-[[2-[4-(3-chlorophenyl)piperazino]acetyl]amino]-N,N,4-trimethyl-thiazole-5-carboxamide::MLS001008811::SMR000499050::cid_6466213
SMILES CN(C)C(=O)c1sc(NC(=O)CN2CCN(CC2)c2cccc(Cl)c2)nc1C
InChI Key InChIKey=PQVDVNNIIWBKDK-UHFFFAOYSA-N
Data  1 EC50
  Tab Delimited (TSV)   2D SDfile   Computed 3D by Vconf -m prep SDfile
Find this compound or compounds like it in BindingDB:
Activity Spreadsheet -- Enzyme Inhibition Constant Data from BindingDB
Found 1 hit for monomerid = 66690
TargetBcl-2-like protein 11(Homo sapiens (Human))
Broad Institute
Curated by PubChem BioAssay
LigandPNGBDBM66690(2-({[4-(3-chlorophenyl)-1-piperazinyl]acetyl}amino...)
Affinity DataEC50: >3.50E+5nM. Assay description: Keywords: apoptosis, BH3 domain, Bcl2-A1, BIM, caspase, cancer Primary Collaborator: Todd Golub, Broad Institute, golub@broadinstitute.org Assay Over...
In DepthDetails PCBioAssay