BDBM66746 2-chloranyl-N-(4-methylphenyl)-N-[(2-oxidanylidene-1H-quinolin-4-yl)methyl]ethanamide::2-chloro-N-(4-methylphenyl)-N-[(2-oxo-1H-quinolin-4-yl)methyl]acetamide::2-chloro-N-[(2-keto-1H-quinolin-4-yl)methyl]-N-(p-tolyl)acetamide::MLS001215021::SMR000543256::cid_1399204
SMILES Cc1ccc(cc1)N(Cc1cc(=O)[nH]c2ccccc12)C(=O)CCl
InChI Key InChIKey=WAEFHCKRBYJCQP-UHFFFAOYSA-N
Data  1 EC50
  Tab Delimited (TSV)   2D SDfile   Computed 3D by Vconf -m prep SDfile
Find this compound or compounds like it in BindingDB:
Activity Spreadsheet -- Enzyme Inhibition Constant Data from BindingDB
Found 1 hit for monomerid = 66746
TargetBcl-2-like protein 11(Homo sapiens (Human))
Broad Institute
Curated by PubChem BioAssay
LigandPNGBDBM66746(2-chloranyl-N-(4-methylphenyl)-N-[(2-oxidanylidene...)
Affinity DataEC50: >3.50E+5nM. Assay description: Keywords: apoptosis, BH3 domain, Bcl2-A1, BIM, caspase, cancer Primary Collaborator: Todd Golub, Broad Institute, golub@broadinstitute.org Assay Over...
In DepthDetails PCBioAssay