BDBM66865 2-[[4-allyl-5-(2-pyridyl)-1,2,4-triazol-3-yl]thio]-N-cyclopropyl-acetamide::MLS001162124::N-cyclopropyl-2-[(4-prop-2-enyl-5-pyridin-2-yl-1,2,4-triazol-3-yl)sulfanyl]acetamide::N-cyclopropyl-2-[(4-prop-2-enyl-5-pyridin-2-yl-1,2,4-triazol-3-yl)sulfanyl]ethanamide::N-cyclopropyl-2-[[4-prop-2-enyl-5-(2-pyridinyl)-1,2,4-triazol-3-yl]thio]acetamide::SMR000670996::cid_6464946
SMILES C=CCn1c(SCC(=O)NC2CC2)nnc1-c1ccccn1
InChI Key InChIKey=SDVIDRNPKIHMRH-UHFFFAOYSA-N
Data  1 EC50
  Tab Delimited (TSV)   2D SDfile   Computed 3D by Vconf -m prep SDfile
Find this compound or compounds like it in BindingDB:
Activity Spreadsheet -- Enzyme Inhibition Constant Data from BindingDB
Found 1 hit for monomerid = 66865
TargetBcl-2-like protein 11(Homo sapiens (Human))
Broad Institute
Curated by PubChem BioAssay
LigandPNGBDBM66865(2-[[4-allyl-5-(2-pyridyl)-1,2,4-triazol-3-yl]thio]...)
Affinity DataEC50: >3.50E+5nM. Assay description: Keywords: apoptosis, BH3 domain, Bcl2-A1, BIM, caspase, cancer Primary Collaborator: Todd Golub, Broad Institute, golub@broadinstitute.org Assay Over...
In DepthDetails PCBioAssay