BDBM6690 6-[(Z)-1-(2,6-difluorophenyl)-2-(1H-1,2,3,4-tetrazol-5-yl)ethenyl]-3-[(2,6-difluorophenyl)carbonyl]imidazo[1,2-a]pyridin-2-amine::aminoimidazo[1,2-a]pyridine deriv. 28
SMILES Nc1nc2ccc(cn2c1C(=O)c1c(F)cccc1F)C(=Cc1nnn[nH]1)c1c(F)cccc1F
InChI Key InChIKey=SWIJDJBVBQCVKN-UHFFFAOYSA-N
Data  3 IC50
  Tab Delimited (TSV)   2D SDfile   Computed 3D by Vconf -m prep SDfile
Find this compound or compounds like it in BindingDB:
Activity Spreadsheet -- Enzyme Inhibition Constant Data from BindingDB
Found 3 hits for monomerid = 6690
TargetCyclin-dependent kinase 2/G1/S-specific cyclin-E1(Homo sapiens (Human))
Avenida De La Industria
LigandPNGBDBM6690(6-[(Z)-1-(2,6-difluorophenyl)-2-(1H-1,2,3,4-tetraz...)
Affinity DataIC50:  1.69E+3nMpH: 7.0 T: 2°C. Assay description: In vitro CDK assay using purified enzyme, was incubated at room temperature with substrate, and test compounds in the presence of ATP/[gamma-33P]ATP....
In DepthDetails ArticlePubMed
TargetCyclin-dependent kinase 4/G1/S-specific cyclin-D1(Homo sapiens (Human))
Avenida De La Industria
LigandPNGBDBM6690(6-[(Z)-1-(2,6-difluorophenyl)-2-(1H-1,2,3,4-tetraz...)
Affinity DataIC50:  1.70E+3nMT: 2°C. Assay description: In vitro CDK assay using purified enzyme, was incubated at room temperature with substrate, and test compounds in the presence of ATP/[gamma-33P]ATP....
In DepthDetails ArticlePubMed
TargetCyclin-dependent kinase/G2/mitotic-specific cyclin- 1(Homo sapiens (Human))
Avenida De La Industria
LigandPNGBDBM6690(6-[(Z)-1-(2,6-difluorophenyl)-2-(1H-1,2,3,4-tetraz...)
Affinity DataIC50:  96nMT: 2°C. Assay description: In vitro CDK assay using purified enzyme, was incubated at room temperature with substrate, and test compounds in the presence of ATP/[gamma-33P]ATP....
In DepthDetails ArticlePubMed