BDBM67075 4-mesylbenzoic acid [2-keto-2-[(1-methylpyrrole-2-carbonyl)amino]ethyl] ester::4-methylsulfonylbenzoic acid [2-[[(1-methyl-2-pyrrolyl)-oxomethyl]amino]-2-oxoethyl] ester::MLS002251582::SMR001313972::[2-[(1-methylpyrrol-2-yl)carbonylamino]-2-oxidanylidene-ethyl] 4-methylsulfonylbenzoate::[2-[(1-methylpyrrole-2-carbonyl)amino]-2-oxoethyl] 4-methylsulfonylbenzoate::cid_9102374
SMILES Cn1cccc1C(=O)NC(=O)COC(=O)c1ccc(cc1)S(C)(=O)=O
InChI Key InChIKey=PUPNGCOZLLITKR-UHFFFAOYSA-N
Data  1 EC50
  Tab Delimited (TSV)   2D SDfile   Computed 3D by Vconf -m prep SDfile
Find this compound or compounds like it in BindingDB:
Activity Spreadsheet -- Enzyme Inhibition Constant Data from BindingDB
Found 1 hit for monomerid = 67075
TargetBcl-2-like protein 11(Homo sapiens (Human))
Broad Institute
Curated by PubChem BioAssay
LigandPNGBDBM67075(4-mesylbenzoic acid [2-keto-2-[(1-methylpyrrole-2-...)
Affinity DataEC50: >3.50E+5nM. Assay description: Keywords: apoptosis, BH3 domain, Bcl2-A1, BIM, caspase, cancer Primary Collaborator: Todd Golub, Broad Institute, golub@broadinstitute.org Assay Over...
In DepthDetails PCBioAssay