BDBM67401 2-(4-tert-butylphenyl)sulfonyl-5-(3,4-dimethoxyphenyl)-3-pyrazolamine::2-(4-tert-butylphenyl)sulfonyl-5-(3,4-dimethoxyphenyl)pyrazol-3-amine::MLS-0067136.0001::[2-(4-tert-butylphenyl)sulfonyl-5-(3,4-dimethoxyphenyl)pyrazol-3-yl]amine::cid_16654630
SMILES COc1ccc(cc1OC)-c1cc(N)n(n1)S(=O)(=O)c1ccc(cc1)C(C)(C)C
InChI Key InChIKey=IKRCGKYHNMASOR-UHFFFAOYSA-N
Data  3 IC50
  Tab Delimited (TSV)   2D SDfile   Computed 3D by Vconf -m prep SDfile
Find this compound or compounds like it in BindingDB:
Activity Spreadsheet -- Enzyme Inhibition Constant Data from BindingDB
Found 3 hits for monomerid = 67401
TargetNucleotide-binding oligomerization domain-containing protein 1(Homo sapiens (Human))
Burnham Center For Chemical Genomics
Curated by PubChem BioAssay
LigandPNGBDBM67401(2-(4-tert-butylphenyl)sulfonyl-5-(3,4-dimethoxyphe...)
Affinity DataIC50: >2.00E+4nM. Assay description: Data Source: Sanford-Burnham Center for Chemical Genomics (SBCCG) Source Affiliation: Sanford-Burnham Medical Research Institute (SBMRI, San Diego, C...
In DepthDetails PCBioAssay
TargetTumor necrosis factor(Homo sapiens (Human))
Burnham Center For Chemical Genomics
Curated by PubChem BioAssay
LigandPNGBDBM67401(2-(4-tert-butylphenyl)sulfonyl-5-(3,4-dimethoxyphe...)
Affinity DataIC50: >2.00E+4nM. Assay description: Data Source: Sanford-Burnham Center for Chemical Genomics (SBCCG) Source Affiliation: Sanford-Burnham Medical Research Institute (SBMRI, San Diego, C...
In DepthDetails PCBioAssay
TargetNucleotide-binding oligomerization domain-containing protein 2(Homo sapiens (Human))
Burnham Center For Chemical Genomics
Curated by PubChem BioAssay
LigandPNGBDBM67401(2-(4-tert-butylphenyl)sulfonyl-5-(3,4-dimethoxyphe...)
Affinity DataIC50: >2.00E+4nM. Assay description: Data Source: Sanford-Burnham Center for Chemical Genomics (SBCCG) Source Affiliation: Sanford-Burnham Medical Research Institute (SBMRI, San Diego, C...
In DepthDetails PCBioAssay