BDBM67419 MLS000041097::SMR000046340::cid_665289
SMILES CN1CC2=Cc3ccccc3OC22Oc3ccccc3C=C2C1
InChI Key InChIKey=AEYQPEUDXAQAFL-UHFFFAOYSA-N
Data  5 IC50
  Tab Delimited (TSV)   2D SDfile   Computed 3D by Vconf -m prep SDfile
Find this compound or compounds like it in BindingDB:
Activity Spreadsheet -- Enzyme Inhibition Constant Data from BindingDB
Found 5 hits for monomerid = 67419
TargetProtein Rev(Human immunodeficiency virus 1)
The Scripps Research Institute Molecular Screening Center
Curated by PubChem BioAssay
LigandPNGBDBM67419(MLS000041097 | SMR000046340 | cid_665289)
Affinity DataIC50: >7.54E+4nM. Assay description: Source (MLPCN Center Name): The Scripps Research Institute Molecular Screening Center (SRIMSC) Affiliation: The Scripps Research Institute, TSRI Assa...
In DepthDetails PCBioAssay
TargetFemale germline-specific tumor suppressor gld-1(Caenorhabditis elegans)
The Scripps Research Institute Molecular Screening Center
Curated by PubChem BioAssay
LigandPNGBDBM67419(MLS000041097 | SMR000046340 | cid_665289)
Affinity DataIC50: >5.96E+4nM. Assay description: Source (MLPCN Center Name): The Scripps Research Institute Molecular Screening Center (SRIMSC) Affiliation: The Scripps Research Institute, TSRI Assa...
In DepthDetails PCBioAssay
TargetUbiquitin-conjugating enzyme E2 N(Homo sapiens (Human))
Burnham Center For Chemical Genomics
Curated by PubChem BioAssay
LigandPNGBDBM67419(MLS000041097 | SMR000046340 | cid_665289)
Affinity DataIC50:  3.50E+3nM. Assay description: Data Source: Sanford-Burnham Center for Chemical Genomics (SBCCG) Source Affiliation: Sanford-Burnham Medical Research Institute (SBMRI, San Diego CA...
In DepthDetails PCBioAssay
TargetBcl-2-related protein A1(Mus musculus (Mouse))
Burnham Center For Chemical Genomics
Curated by PubChem BioAssay
LigandPNGBDBM67419(MLS000041097 | SMR000046340 | cid_665289)
Affinity DataIC50: >2.00E+4nM. Assay description: Data Source: Sanford-Burnham Center for Chemical Genomics (SBCCG) Source Affiliation: Sanford-Burnham Medical Research Institute (SBMRI, San Diego CA...
In DepthDetails PCBioAssay
TargetUbiquitin-conjugating enzyme E2 N(Homo sapiens (Human))
Burnham Center For Chemical Genomics
Curated by PubChem BioAssay
LigandPNGBDBM67419(MLS000041097 | SMR000046340 | cid_665289)
Affinity DataIC50:  2.55E+3nM. Assay description: Data Source: Sanford-Burnham Center for Chemical Genomics (SBCCG) Source Affiliation: Sanford-Burnham Medical Research Institute (SBMRI, San Diego CA...
In DepthDetails PCBioAssay