BDBM6742 1,7-Annulated indolocarbazole deriv. 13Aa::25-(hydroxymethyl)-1,4,14-triazaheptacyclo[16.7.1.0^{2,17}.0^{3,11}.0^{5,10}.0^{12,16}.0^{22,26}]hexacosa-2(17),3(11),5(10),6,8,12(16),18(26),19,21-nonaene-13,15-dione
SMILES OCC1CCc2cccc3c4c5C(=O)NC(=O)c5c5c6ccccc6[nH]c5c4n1c23
InChI Key InChIKey=YPDLMDMBCACZDE-UHFFFAOYSA-N
Data  3 IC50
  Tab Delimited (TSV)   2D SDfile   Computed 3D by Vconf -m prep SDfile
Find this compound or compounds like it in BindingDB:
Activity Spreadsheet -- Enzyme Inhibition Constant Data from BindingDB
Found 3 hits for monomerid = 6742
TargetCyclin-dependent kinase 4/G1/S-specific cyclin-D1(Homo sapiens (Human))
Eli Lilly
LigandPNGBDBM6742(1,7-Annulated indolocarbazole deriv. 13Aa | 25-(hy...)
Affinity DataIC50:  18nMpH: 7.0 T: 2°C. Assay description: In vitro CDK assay using purified enzyme, was incubated at room temperature with substrate, and test compounds in the presence of ATP/[gamma-33P]ATP....
In DepthDetails ArticlePubMed
TargetcAMP-dependent protein kinase catalytic subunit alpha(Bos taurus (bovine))
Eli Lilly
LigandPNGBDBM6742(1,7-Annulated indolocarbazole deriv. 13Aa | 25-(hy...)
Affinity DataIC50:  858nMT: 2°C. Assay description: In vitro assay using purified enzyme, was incubated at room temperature with substrate, and test compounds in the presence of ATP/[gamma-33P]ATP. 33P...
In DepthDetails ArticlePubMed
TargetCyclin-dependent kinase 2/G1/S-specific cyclin-E1(Homo sapiens (Human))
Eli Lilly
LigandPNGBDBM6742(1,7-Annulated indolocarbazole deriv. 13Aa | 25-(hy...)
Affinity DataIC50:  219nMT: 2°C. Assay description: In vitro assay using purified enzyme, was incubated at room temperature with substrate, and test compounds in the presence of ATP/[gamma-33P]ATP. 33P...
In DepthDetails ArticlePubMed