BDBM67488 N-[(E)-(phenylmethylene)amino]aniline::N-[(E)-(phenylmethylidene)amino]aniline::N-[(E)-benzylideneamino]aniline::SR-03000000709-1::[(E)-benzalamino]-phenyl-amine::cid_6436752
SMILES C(N=Nc1ccccc1)c1ccccc1
InChI Key InChIKey=OFPLKXJFHUIDJF-UHFFFAOYSA-N
Data  1 IC50
  Tab Delimited (TSV)   2D SDfile   Computed 3D by Vconf -m prep SDfile
Find this compound or compounds like it in BindingDB:
Activity Spreadsheet -- Enzyme Inhibition Constant Data from BindingDB
Found 1 hit for monomerid = 67488
TargetNADPH oxidase 1(Homo sapiens (Human))
The Scripps Research Institute Molecular Screening Center
Curated by PubChem BioAssay
LigandPNGBDBM67488(N-[(E)-(phenylmethylene)amino]aniline | N-[(E)-(ph...)
Affinity DataIC50:  1.31E+4nM. Assay description: Data Source (MLPCN Center Name): The Scripps Research Institute Molecular Screening Center (SRIMSC) Center Affiliation: The Scripps Research Institut...
Ligand InfoPC cidPC sid
In DepthDetails PCBioAssay