BDBM67593 1,3-benzodioxole-5-carboxylic acid [(Z)-[amino-(3-methylphenyl)methylidene]amino] ester::MLS000579340::N'-[(1,3-benzodioxol-5-ylcarbonyl)oxy]-3-methylbenzenecarboximidamide::SMR000198623::[(Z)-[amino-(3-methylphenyl)methylidene]amino] 1,3-benzodioxole-5-carboxylate::[(Z)-[azanyl-(3-methylphenyl)methylidene]amino] 1,3-benzodioxole-5-carboxylate::cid_9587494::piperonylic acid [(Z)-[amino(m-tolyl)methylene]amino] ester
SMILES Cc1cccc(c1)C(N)=NOC(=O)c1ccc2OCOc2c1
InChI Key InChIKey=XJRCBCDSXLCYBN-UHFFFAOYSA-N
Data  1 EC50
  Tab Delimited (TSV)   2D SDfile   Computed 3D by Vconf -m prep SDfile
Find this compound or compounds like it in BindingDB:
Activity Spreadsheet -- Enzyme Inhibition Constant Data from BindingDB
Found 1 hit for monomerid = 67593
TargetSerine/threonine-protein kinase 33(Homo sapiens (Human))
Broad Institute
Curated by PubChem BioAssay
LigandPNGBDBM67593(1,3-benzodioxole-5-carboxylic acid [(Z)-[amino-(3-...)
Affinity DataEC50:  3.73E+4nM. Assay description: Keywords: STK33 Kinase, Non-ATP Competitive Inhibitor Assay Overview: Purified STK33 Kinase is preincubated with potential inhibitors and allowed to ...
In DepthDetails PCBioAssay