BDBM67768 5-hydroxy-4-(4-morpholinylmethyl)-2-phenyl-3-benzofurancarboxylic acid ethyl ester::5-hydroxy-4-(morpholinomethyl)-2-phenyl-benzofuran-3-carboxylic acid ethyl ester::MLS000061958::SMR000070819::cid_1113703::ethyl 4-(morpholin-4-ylmethyl)-5-oxidanyl-2-phenyl-1-benzofuran-3-carboxylate::ethyl 5-hydroxy-4-(4-morpholinylmethyl)-2-phenyl-1-benzofuran-3-carboxylate::ethyl 5-hydroxy-4-(morpholin-4-ylmethyl)-2-phenyl-1-benzofuran-3-carboxylate
SMILES CCOC(=O)c1c(oc2ccc(O)c(CN3CCOCC3)c12)-c1ccccc1
InChI Key InChIKey=OGXGATRCXHSTEV-UHFFFAOYSA-N
Data  3 IC50
PDB links: 1 PDB ID matches this monomer.
  Tab Delimited (TSV)   2D SDfile   Computed 3D by Vconf -m prep SDfile
Find this compound or compounds like it in BindingDB:
Activity Spreadsheet -- Enzyme Inhibition Constant Data from BindingDB
Found 3 hits for monomerid = 67768
TargetDNA damage-inducible transcript 3 protein(Mus musculus)
Emory University
Curated by PubChem BioAssay
LigandPNGBDBM67768(5-hydroxy-4-(4-morpholinylmethyl)-2-phenyl-3-benzo...)
Affinity DataIC50:  4.91E+3nM. Assay description: NIH Molecular Libraries Screening Centers Network [MLSCN] Emory Chemical Biology Discovery Center in MLSCN Assay provider: Dr. Randal Kaufman, Univer...
In DepthDetails PCBioAssay
TargetDNA damage-inducible transcript 3 protein(Mus musculus)
Emory University
Curated by PubChem BioAssay
LigandPNGBDBM67768(5-hydroxy-4-(4-morpholinylmethyl)-2-phenyl-3-benzo...)
Affinity DataIC50:  4.91E+3nM. Assay description: NIH Molecular Libraries Screening Centers Network [MLSCN] Emory Chemical Biology Discovery Center in MLSCN Assay provider: Dr. Randal Kaufman, Univer...
In DepthDetails PCBioAssay
TargetX-box-binding protein 1(Homo sapiens (Human))
Emory University
Curated by PubChem BioAssay
LigandPNGBDBM67768(5-hydroxy-4-(4-morpholinylmethyl)-2-phenyl-3-benzo...)
Affinity DataIC50:  160nM. Assay description: NIH Molecular Libraries Screening Centers Network [MLSCN] Emory Chemical Biology Discovery Center in MLSCN Assay provider: Dr. Randal Kaufman, Univer...
In DepthDetails PCBioAssay