BDBM67995 1-(9-carbazolyl)-3-(2,2,3,3,4,4,5,5-octafluoropentoxy)-2-propanol::1-Carbazol-9-yl-3-(2,2,3,3,4,4,5,5-octafluoro-pentyloxy)-propan-2-ol::1-carbazol-9-yl-3-(2,2,3,3,4,4,5,5-octafluoropentoxy)propan-2-ol::1-carbazol-9-yl-3-[2,2,3,3,4,4,5,5-octakis(fluoranyl)pentoxy]propan-2-ol::MLS000559736::SMR000176805::cid_3129563
SMILES OC(COCC(F)(F)C(F)(F)C(F)(F)C(F)F)Cn1c2ccccc2c2ccccc12
InChI Key InChIKey=BKQACYCBLLJVJL-UHFFFAOYSA-N
Data  5 IC50
  Tab Delimited (TSV)   2D SDfile   Computed 3D by Vconf -m prep SDfile
Find this compound or compounds like it in BindingDB:
Activity Spreadsheet -- Enzyme Inhibition Constant Data from BindingDB
Found 5 hits for monomerid = 67995
TargetDNA damage-inducible transcript 3 protein(Mus musculus)
Emory University
Curated by PubChem BioAssay
LigandPNGBDBM67995(1-(9-carbazolyl)-3-(2,2,3,3,4,4,5,5-octafluoropent...)
Affinity DataIC50:  2.15E+3nM. Assay description: NIH Molecular Libraries Screening Centers Network [MLSCN] Emory Chemical Biology Discovery Center in MLSCN Assay provider: Dr. Randal Kaufman, Univer...
In DepthDetails PCBioAssay
TargetX-box-binding protein 1(Homo sapiens (Human))
Emory University
Curated by PubChem BioAssay
LigandPNGBDBM67995(1-(9-carbazolyl)-3-(2,2,3,3,4,4,5,5-octafluoropent...)
Affinity DataIC50:  5.11E+3nM. Assay description: NIH Molecular Libraries Screening Centers Network [MLSCN] Emory Chemical Biology Discovery Center in MLSCN Assay provider: Dr. Randal Kaufman, Univer...
In DepthDetails PCBioAssay
TargetDisintegrin and metalloproteinase domain-containing protein 17(Homo sapiens (Human))
The Scripps Research Institute Molecular Screening Center
Curated by PubChem BioAssay
LigandPNGBDBM67995(1-(9-carbazolyl)-3-(2,2,3,3,4,4,5,5-octafluoropent...)
Affinity DataIC50:  6.95E+4nM. Assay description: Source (MLPCN Center Name): The Scripps Research Institute Molecular Screening Center (SRIMSC) Center Affiliation: Torrey Pines Institute for Molecul...
In DepthDetails PCBioAssay
TargetDisintegrin and metalloproteinase domain-containing protein 10(Homo sapiens (Human))
The Scripps Research Institute Molecular Screening Center
Curated by PubChem BioAssay
LigandPNGBDBM67995(1-(9-carbazolyl)-3-(2,2,3,3,4,4,5,5-octafluoropent...)
Affinity DataIC50:  7.73E+3nM. Assay description: Source (MLPCN Center Name): The Scripps Research Institute Molecular Screening Center (SRIMSC) Center Affiliation: Torrey Pines Institute for Molecul...
In DepthDetails PCBioAssay
TargetDNA damage-inducible transcript 3 protein(Mus musculus)
Emory University
Curated by PubChem BioAssay
LigandPNGBDBM67995(1-(9-carbazolyl)-3-(2,2,3,3,4,4,5,5-octafluoropent...)
Affinity DataIC50:  2.15E+3nM. Assay description: NIH Molecular Libraries Screening Centers Network [MLSCN] Emory Chemical Biology Discovery Center in MLSCN Assay provider: Dr. Randal Kaufman, Univer...
In DepthDetails PCBioAssay