BDBM68128 1-chloranyl-7,8-bis(fluoranyl)-3-methyl-pyrido[1,2-a]benzimidazole-4-carbonitrile::1-chloro-7,8-difluoro-3-methyl-4-pyrido[1,2-a]benzimidazolecarbonitrile::1-chloro-7,8-difluoro-3-methyl-pyrido[1,2-a]benzimidazole-4-carbonitrile::1-chloro-7,8-difluoro-3-methylpyrido[1,2-a]benzimidazole-4-carbonitrile::MLS000729184::SMR000307462::cid_1507407
SMILES Cc1cc(Cl)n2c(nc3cc(F)c(F)cc23)c1C#N
InChI Key InChIKey=ZRMURZLAKFYTGW-UHFFFAOYSA-N
Data  3 IC50  2 EC50
  Tab Delimited (TSV)   2D SDfile   Computed 3D by Vconf -m prep SDfile
Find this compound or compounds like it in BindingDB:
Activity Spreadsheet -- Enzyme Inhibition Constant Data from BindingDB
Found 5 hits for monomerid = 68128
TargetDNA damage-inducible transcript 3 protein(Mus musculus)
Emory University
Curated by PubChem BioAssay
LigandPNGBDBM68128(1-chloranyl-7,8-bis(fluoranyl)-3-methyl-pyrido[1,2...)
Affinity DataIC50: >1.00E+4nM. Assay description: NIH Molecular Libraries Screening Centers Network [MLSCN] Emory Chemical Biology Discovery Center in MLSCN Assay provider: Dr. Randal Kaufman, Univer...
In DepthDetails PCBioAssay
TargetHeat shock factor protein 1(Mus musculus)
Broad Institute
Curated by PubChem BioAssay
LigandPNGBDBM68128(1-chloranyl-7,8-bis(fluoranyl)-3-methyl-pyrido[1,2...)
Affinity DataEC50:  3.36E+3nM. Assay description: Keywords: Heat Shock Factor-1 (HSF-1), Stress Response, MG132, NIH3T3, Luminescence Assay Overview: Confirmation testing of small molecules identifie...
In DepthDetails PCBioAssay
TargetOrotidine 5'-phosphate decarboxylase(Aspergillus niger)
The Scripps Research Institute Molecular Screening Center
Curated by PubChem BioAssay
LigandPNGBDBM68128(1-chloranyl-7,8-bis(fluoranyl)-3-methyl-pyrido[1,2...)
Affinity DataEC50: >5.96E+4nM. Assay description: Source (MLPCN Center Name): The Scripps Research Institute Molecular Screening Center (SRISMC) Center Affiliation: The Scripps Research Institute, TS...
In DepthDetails PCBioAssay
TargetX-box-binding protein 1(Homo sapiens (Human))
Emory University
Curated by PubChem BioAssay
LigandPNGBDBM68128(1-chloranyl-7,8-bis(fluoranyl)-3-methyl-pyrido[1,2...)
Affinity DataIC50:  2.67E+3nM. Assay description: NIH Molecular Libraries Screening Centers Network [MLSCN] Emory Chemical Biology Discovery Center in MLSCN Assay provider: Dr. Randal Kaufman, Univer...
In DepthDetails PCBioAssay
TargetDNA damage-inducible transcript 3 protein(Mus musculus)
Emory University
Curated by PubChem BioAssay
LigandPNGBDBM68128(1-chloranyl-7,8-bis(fluoranyl)-3-methyl-pyrido[1,2...)
Affinity DataIC50: >1.00E+4nM. Assay description: NIH Molecular Libraries Screening Centers Network [MLSCN] Emory Chemical Biology Discovery Center in MLSCN Assay provider: Dr. Randal Kaufman, Univer...
In DepthDetails PCBioAssay