BDBM68267 M-31860
SMILES O=C1N(CC2CCCO2)C(=O)c2cccc3cccc1c23
InChI Key InChIKey=ZOASFBHPCHNXHZ-UHFFFAOYSA-N
Data  1 IC50
  Tab Delimited (TSV)   2D SDfile   Computed 3D by Vconf -m prep SDfile
Find this compound or compounds like it in BindingDB:
Activity Spreadsheet -- Enzyme Inhibition Constant Data from BindingDB
Found 1 hit for monomerid = 68267
TargetBeta-hexosaminidase subunit alpha(Homo sapiens (Human))
Research Institute, Hospital For Sick Children
LigandPNGBDBM68267(M-31860)
Affinity DataIC50:  1.38E+5nMT: 2°C. Assay description: Enzyme assay based on 4-MU substrates with HTS to identify inhibitory compounds for Hex.
In DepthDetails ArticlePubMed