BDBM68300 MLS-0435529.0001::N-(2-isopropoxy-5-morpholinosulfonyl-phenyl)-5,6,7,8-tetrahydro-4H-cyclohepta[b]thiophene-2-carboxamide::N-(5-morpholin-4-ylsulfonyl-2-propan-2-yloxy-phenyl)-5,6,7,8-tetrahydro-4H-cyclohepta[b]thiophene-2-carboxamide::N-(5-morpholin-4-ylsulfonyl-2-propan-2-yloxyphenyl)-5,6,7,8-tetrahydro-4H-cyclohepta[b]thiophene-2-carboxamide::N-[5-(4-morpholinylsulfonyl)-2-propan-2-yloxyphenyl]-5,6,7,8-tetrahydro-4H-cyclohepta[b]thiophene-2-carboxamide::cid_4789512
SMILES CC(C)Oc1ccc(cc1NC(=O)c1cc2CCCCCc2s1)S(=O)(=O)N1CCOCC1
InChI Key InChIKey=OHLQUDPQBDLIOC-UHFFFAOYSA-N
Data  3 IC50  2 EC50
  Tab Delimited (TSV)   2D SDfile   Computed 3D by Vconf -m prep SDfile
Find this compound or compounds like it in BindingDB:
Activity Spreadsheet -- Enzyme Inhibition Constant Data from BindingDB
Found 5 hits for monomerid = 68300
TargetCannabinoid receptor 2(Homo sapiens (Human))
Burnham Center For Chemical Genomics
Curated by PubChem BioAssay
LigandPNGBDBM68300(MLS-0435529.0001 | N-(2-isopropoxy-5-morpholinosul...)
Affinity DataIC50: >3.20E+4nM. Assay description: Data Source: Sanford-Burnham Center for Chemical Genomics Source Affiliation: Sanford-Burnham Medical Research Institute (SBMRI, San Diego, CA) Netw...
In DepthDetails PCBioAssay
TargetG-protein coupled receptor 35(Homo sapiens (Human))
Burnham Center For Chemical Genomics
Curated by PubChem BioAssay
LigandPNGBDBM68300(MLS-0435529.0001 | N-(2-isopropoxy-5-morpholinosul...)
Affinity DataEC50: >3.20E+4nM. Assay description: Data Source: Sanford-Burnham Center for Chemical Genomics Source Affiliation: Sanford-Burnham Medical Research Institute (SBMRI) Network: NIH Molec...
In DepthDetails PCBioAssay
TargetCannabinoid receptor 1(Homo sapiens (Human))
Burnham Center For Chemical Genomics
Curated by PubChem BioAssay
LigandPNGBDBM68300(MLS-0435529.0001 | N-(2-isopropoxy-5-morpholinosul...)
Affinity DataIC50:  2.75E+4nM. Assay description: Data Source: Sanford-Burnham Center for Chemical Genomics Source Affiliation: Sanford-Burnham Medical Research Institute (SBMRI, San Diego, CA) Netw...
In DepthDetails PCBioAssay
TargetCannabinoid receptor 2(Homo sapiens (Human))
Burnham Center For Chemical Genomics
Curated by PubChem BioAssay
LigandPNGBDBM68300(MLS-0435529.0001 | N-(2-isopropoxy-5-morpholinosul...)
Affinity DataEC50: >3.20E+4nM. Assay description: Data Source: Sanford-Burnham Center for Chemical Genomics Source Affiliation: Sanford-Burnham Medical Research Institute (SBMRI, San Diego, CA) Net...
In DepthDetails PCBioAssay
TargetG-protein coupled receptor 35(Homo sapiens (Human))
Burnham Center For Chemical Genomics
Curated by PubChem BioAssay
LigandPNGBDBM68300(MLS-0435529.0001 | N-(2-isopropoxy-5-morpholinosul...)
Affinity DataIC50: >3.20E+4nM. Assay description: Data Source: Sanford-Burnham Center for Chemical Genomics Source Affiliation: Sanford-Burnham Medical Research Institute (SBMRI, San Diego, CA) Netw...
In DepthDetails PCBioAssay