BDBM68325 MLS-0435555.0001::cid_3190037
SMILES COc1ccc(cc1)-c1csc(NC(=O)CSc2nnc3c(C)cc4cc5OCCOc5cc4n23)n1
InChI Key InChIKey=PLKUYFLKWJFBTD-UHFFFAOYSA-N
Data  3 IC50  2 EC50
  Tab Delimited (TSV)   2D SDfile   Computed 3D by Vconf -m prep SDfile
Find this compound or compounds like it in BindingDB:
Activity Spreadsheet -- Enzyme Inhibition Constant Data from BindingDB
Found 5 hits for monomerid = 68325
TargetCannabinoid receptor 2(Homo sapiens (Human))
Burnham Center For Chemical Genomics
Curated by PubChem BioAssay
LigandPNGBDBM68325(MLS-0435555.0001 | cid_3190037)
Affinity DataIC50: >3.20E+4nM. Assay description: Data Source: Sanford-Burnham Center for Chemical Genomics Source Affiliation: Sanford-Burnham Medical Research Institute (SBMRI, San Diego, CA) Netw...
In DepthDetails PCBioAssay
TargetG-protein coupled receptor 35(Homo sapiens (Human))
Burnham Center For Chemical Genomics
Curated by PubChem BioAssay
LigandPNGBDBM68325(MLS-0435555.0001 | cid_3190037)
Affinity DataEC50: >3.20E+4nM. Assay description: Data Source: Sanford-Burnham Center for Chemical Genomics Source Affiliation: Sanford-Burnham Medical Research Institute (SBMRI) Network: NIH Molec...
In DepthDetails PCBioAssay
TargetCannabinoid receptor 1(Homo sapiens (Human))
Burnham Center For Chemical Genomics
Curated by PubChem BioAssay
LigandPNGBDBM68325(MLS-0435555.0001 | cid_3190037)
Affinity DataIC50: >3.20E+4nM. Assay description: Data Source: Sanford-Burnham Center for Chemical Genomics Source Affiliation: Sanford-Burnham Medical Research Institute (SBMRI, San Diego, CA) Netw...
In DepthDetails PCBioAssay
TargetCannabinoid receptor 2(Homo sapiens (Human))
Burnham Center For Chemical Genomics
Curated by PubChem BioAssay
LigandPNGBDBM68325(MLS-0435555.0001 | cid_3190037)
Affinity DataEC50: >3.20E+4nM. Assay description: Data Source: Sanford-Burnham Center for Chemical Genomics Source Affiliation: Sanford-Burnham Medical Research Institute (SBMRI, San Diego, CA) Net...
In DepthDetails PCBioAssay
TargetG-protein coupled receptor 35(Homo sapiens (Human))
Burnham Center For Chemical Genomics
Curated by PubChem BioAssay
LigandPNGBDBM68325(MLS-0435555.0001 | cid_3190037)
Affinity DataIC50: >3.20E+4nM. Assay description: Data Source: Sanford-Burnham Center for Chemical Genomics Source Affiliation: Sanford-Burnham Medical Research Institute (SBMRI, San Diego, CA) Netw...
In DepthDetails PCBioAssay