BDBM68415 2-amino-6-(3-pyridinyl)-4-thiophen-2-yl-3-pyridinecarbonitrile::2-amino-6-(3-pyridyl)-4-(2-thienyl)nicotinonitrile::2-amino-6-pyridin-3-yl-4-thiophen-2-ylpyridine-3-carbonitrile::2-azanyl-6-pyridin-3-yl-4-thiophen-2-yl-pyridine-3-carbonitrile::MLS000040726::SMR000043147::cid_662367
SMILES Nc1nc(cc(-c2cccs2)c1C#N)-c1cccnc1
InChI Key InChIKey=XLCPNRLDDFGYOX-UHFFFAOYSA-N
Data  1 EC50
  Tab Delimited (TSV)   2D SDfile   Computed 3D by Vconf -m prep SDfile
Find this compound or compounds like it in BindingDB:
Activity Spreadsheet -- Enzyme Inhibition Constant Data from BindingDB
Found 1 hit for monomerid = 68415
TargetGlycogen synthase kinase-3 beta(Homo sapiens (Human))
Broad Institute
Curated by PubChem BioAssay
LigandPNGBDBM68415(2-amino-6-(3-pyridinyl)-4-thiophen-2-yl-3-pyridine...)
Affinity DataEC50:  1.04E+4nM. Assay description: Keywords: GSK3beta, dose response, kinase, inhibition, HTS Assay Overview: The glycogen synthase kinase-3 beta (GSK-3b) is a known master regulator f...
In DepthDetails PCBioAssay