BDBM68432 MLS000082642::N-(3-imidazol-1-ylpropyl)-[1]benzofuro[3,2-d]pyrimidin-4-amine;hydrochloride::N-[3-(1-imidazolyl)propyl]-4-benzofuro[3,2-d]pyrimidinamine;hydrochloride::SMR000045608::benzofuro[3,2-d]pyrimidin-4-yl(3-imidazol-1-ylpropyl)amine;hydrochloride::cid_6603365
SMILES C(CNc1ncnc2c3ccccc3oc12)Cn1ccnc1
InChI Key InChIKey=DHJFFONHJKAJGA-UHFFFAOYSA-N
Data  1 EC50
  Tab Delimited (TSV)   2D SDfile   Computed 3D by Vconf -m prep SDfile
Find this compound or compounds like it in BindingDB:
Activity Spreadsheet -- Enzyme Inhibition Constant Data from BindingDB
Found 1 hit for monomerid = 68432
TargetGlycogen synthase kinase-3 beta(Homo sapiens (Human))
Broad Institute
Curated by PubChem BioAssay
LigandPNGBDBM68432(MLS000082642 | N-(3-imidazol-1-ylpropyl)-[1]benzof...)
Affinity DataEC50: >3.00E+5nM. Assay description: Keywords: GSK3beta, dose response, kinase, inhibition, HTS Assay Overview: The glycogen synthase kinase-3 beta (GSK-3b) is a known master regulator f...
In DepthDetails PCBioAssay