BDBM6876 1-Acyl-1H-[1,2,4]triazole-3,5-diamine Analogue 3l::4-({5-amino-1-[(2,6-difluorobenzene)sulfonyl]-1H-1,2,4-triazol-3-yl}amino)benzene-1-sulfonamide::4-[5-Amino-1-(2,6-difluoro-benzenesulfonyl)-1H-[1,2,4]triazol-3-ylamino]-benzenesulfonamide
SMILES Nc1nc(Nc2ccc(cc2)S(N)(=O)=O)nn1S(=O)(=O)c1c(F)cccc1F
InChI Key InChIKey=NYXCLBKLCFJOCG-UHFFFAOYSA-N
Data  1 IC50
  Tab Delimited (TSV)   2D SDfile   Computed 3D by Vconf -m prep SDfile
Find this compound or compounds like it in BindingDB:
Activity Spreadsheet -- Enzyme Inhibition Constant Data from BindingDB
Found 1 hit for monomerid = 6876
TargetCyclin-dependent kinase/G2/mitotic-specific cyclin- 1(Homo sapiens (Human))
Johnson & Johnson Pharmaceutical
LigandPNGBDBM6876(1-Acyl-1H-[1,2,4]triazole-3,5-diamine Analogue 3l ...)
Affinity DataIC50:  660nMpH: 8.0 T: 2°C. Assay description: The enzyme was assayed with a biotinylated peptide substrate and test compounds in the presence of 10 uM ATP/[gamma-33P]ATP in a streptavidin coated ...
Ligand InfoPC cidPC sid
In DepthDetails ArticlePubMed