BDBM6884 3-Acyl-2,6-diaminopyridine deriv. 2d::4-({6-amino-5-[(2,6-difluorophenyl)carbonyl]pyridin-2-yl}amino)benzoic acid
SMILES Nc1nc(Nc2ccc(cc2)C(O)=O)ccc1C(=O)c1c(F)cccc1F
InChI Key InChIKey=CVSDWWDMOFGSDC-UHFFFAOYSA-N
Data  1 IC50
  Tab Delimited (TSV)   2D SDfile   Computed 3D by Vconf -m prep SDfile
Find this compound or compounds like it in BindingDB:
Activity Spreadsheet -- Enzyme Inhibition Constant Data from BindingDB
Found 1 hit for monomerid = 6884
TargetCyclin-dependent kinase/G2/mitotic-specific cyclin- 1(Homo sapiens (Human))
Johnson & Johnson Pharmaceutical
LigandPNGBDBM6884(3-Acyl-2,6-diaminopyridine deriv. 2d | 4-({6-amino...)
Affinity DataIC50:  1.00E+4nMpH: 8.0 T: 2°C. Assay description: The enzyme was assayed with a biotinylated peptide substrate and test compounds in the presence of 10 uM ATP/[gamma-33P]ATP in a streptavidin coated ...
In DepthDetails ArticlePubMed