BDBM68992 4-(4-Morpholin-4-yl-phenylamino)-quinoline-3,6-dicarboxylic acid diethyl ester::4-(4-morpholinoanilino)quinoline-3,6-dicarboxylic acid diethyl ester::4-[4-(4-morpholinyl)anilino]quinoline-3,6-dicarboxylic acid diethyl ester::MLS000590451::SMR000217520::cid_1190175::diethyl 4-(4-morpholin-4-ylanilino)quinoline-3,6-dicarboxylate::diethyl 4-[(4-morpholin-4-ylphenyl)amino]quinoline-3,6-dicarboxylate
SMILES CCOC(=O)c1ccc2ncc(C(=O)OCC)c(Nc3ccc(cc3)N3CCOCC3)c2c1
InChI Key InChIKey=XOKPVAFBMLWNSV-UHFFFAOYSA-N
Data  1 IC50  1 EC50
  Tab Delimited (TSV)   2D SDfile   Computed 3D by Vconf -m prep SDfile
Find this compound or compounds like it in BindingDB:
Activity Spreadsheet -- Enzyme Inhibition Constant Data from BindingDB
Found 2 hits for monomerid = 68992
TargetMelanocortin receptor 4(Homo sapiens (Human))
The Scripps Research Institute Molecular Screening Center
Curated by PubChem BioAssay
LigandPNGBDBM68992(4-(4-Morpholin-4-yl-phenylamino)-quinoline-3,6-dic...)
Affinity DataIC50:  8.67E+3nM. Assay description: Source (MLPCN Center Name): The Scripps Research Institute Molecular Screening Center (SRISMC) Center Affiliation: The Scripps Research Institute, TS...
In DepthDetails PCBioAssay
TargetGlycogen synthase kinase-3 beta(Homo sapiens (Human))
Broad Institute
Curated by PubChem BioAssay
LigandPNGBDBM68992(4-(4-Morpholin-4-yl-phenylamino)-quinoline-3,6-dic...)
Affinity DataEC50: >3.00E+5nM. Assay description: Keywords: GSK3beta, dose response, kinase, inhibition, HTS Assay Overview: The glycogen synthase kinase-3 beta (GSK-3b) is a known master regulator f...
In DepthDetails PCBioAssay