BDBM6904 3-Acyl-2,6-diaminopyridine deriv. 2x::4-{[6-amino-5-(thiophen-2-ylcarbonyl)pyridin-2-yl]amino}-N,N-dimethylbenzene-1-sulfonamide
SMILES CN(C)S(=O)(=O)c1ccc(Nc2ccc(C(=O)c3cccs3)c(N)n2)cc1
InChI Key InChIKey=OXHPVDKXNURGLK-UHFFFAOYSA-N
Data  1 IC50
  Tab Delimited (TSV)   2D SDfile   Computed 3D by Vconf -m prep SDfile
Find this compound or compounds like it in BindingDB:
Activity Spreadsheet -- Enzyme Inhibition Constant Data from BindingDB
Found 1 hit for monomerid = 6904
TargetCyclin-dependent kinase/G2/mitotic-specific cyclin- 1(Homo sapiens (Human))
Johnson & Johnson Pharmaceutical
LigandPNGBDBM6904(3-Acyl-2,6-diaminopyridine deriv. 2x | 4-{[6-amino...)
Affinity DataIC50:  1.27E+4nM. Assay description: The enzyme was assayed with a biotinylated peptide substrate and test compounds in the presence of 5 uM ATP/[gamma-33P]ATP in a streptavidin coated F...
In DepthDetails ArticlePubMed